opencv3-opt

Build Status: FAILURE     Last Build Date: 04.4.2021 00:26

Build Output
warning: dependency cycle detected:
warning: libglvnd will be installed before its mesa dependency
warning: dependency cycle detected:
warning: harfbuzz will be installed before its freetype2 dependency
% Total % Received % Xferd Average Speed Time Time Time Current
Dload Upload Total Spent Left Speed

0 0 0 0 0 0 0 0 --:--:-- --:--:-- --:--:-- 0
100 118 100 118 0 0 728 0 --:--:-- --:--:-- --:--:-- 728

100 12997 0 12997 0 0 36304 0 --:--:-- --:--:-- --:--:-- 36304
100 5862k 0 5862k 0 0 4805k 0 --:--:-- 0:00:01 --:--:-- 6778k
100 8222k 0 8222k 0 0 3205k 0 --:--:-- 0:00:02 --:--:-- 3719k
100 8354k 0 8354k 0 0 2460k 0 --:--:-- 0:00:03 --:--:-- 2746k
100 29.1M 0 29.1M 0 0 7100k 0 --:--:-- 0:00:04 --:--:-- 7755k
100 53.7M 0 53.7M 0 0 10.3M 0 --:--:-- 0:00:05 --:--:-- 11.0M
100 66.6M 0 66.6M 0 0 10.6M 0 --:--:-- 0:00:06 --:--:-- 12.1M
100 83.9M 0 83.9M 0 0 11.6M 0 --:--:-- 0:00:07 --:--:-- 16.3M
100 87.6M 0 87.6M 0 0 11.9M 0 --:--:-- 0:00:07 --:--:-- 20.1M
% Total % Received % Xferd Average Speed Time Time Time Current
Dload Upload Total Spent Left Speed

0 0 0 0 0 0 0 0 --:--:-- --:--:-- --:--:-- 0
100 129 100 129 0 0 816 0 --:--:-- --:--:-- --:--:-- 816

100 10.8M 0 10.8M 0 0 13.1M 0 --:--:-- --:--:-- --:--:-- 13.1M
100 21.6M 0 21.6M 0 0 11.9M 0 --:--:-- 0:00:01 --:--:-- 10.8M
100 33.3M 0 33.3M 0 0 11.7M 0 --:--:-- 0:00:02 --:--:-- 11.2M
100 36.8M 0 36.8M 0 0 9859k 0 --:--:-- 0:00:03 --:--:-- 8870k
100 44.7M 0 44.7M 0 0 9491k 0 --:--:-- 0:00:04 --:--:-- 8674k
100 52.6M 0 52.6M 0 0 10.1M 0 --:--:-- 0:00:05 --:--:-- 9817k
opencv-3.4.12.tar.gz ... Passed
opencv_contrib-3.4.12.tar.gz ... Passed
CMake Warning at cmake/OpenCVDetectPython.cmake:81 (message):
CMake's 'find_host_package(PythonInterp 2.7)' found wrong Python version:

PYTHON_EXECUTABLE=/usr/bin/python

PYTHON_VERSION_STRING=3.9.2

Consider providing the 'PYTHON2_EXECUTABLE' variable via CMake command line
or environment variables

Call Stack (most recent call first):
cmake/OpenCVDetectPython.cmake:271 (find_python)
CMakeLists.txt:606 (include)


/build/src/opencv-3.4.12/modules/core/src/hal_internal.cpp: In function ‘int lapack_QR(fptype*, size_t, int, int, int, fptype*, size_t, fptype*, int*)’:
/build/src/opencv-3.4.12/modules/core/src/hal_internal.cpp:292:111: error: too few arguments to function ‘void dgels_(const char*, const int*, const int*, const int*, double*, const int*, double*, const int*, double*, const int*, int*, size_t)’
292 | dgels_(mode, &m, &n, &k, (double*)tmpA, &ldtmpA, (double*)b, &m, (double*)&work1, &lwork, info);
| ^
In file included from /usr/include/lapack.h:11,
from /usr/include/lapacke.h:36,
from /build/src/build/opencv_lapack.h:12,
from /build/src/opencv-3.4.12/modules/core/src/hal_internal.cpp:50:
/usr/include/lapack.h:1525:6: note: declared here
1525 | void LAPACK_dgels_base(
| ^~~~~~~~~~~~~~~~~
/build/src/opencv-3.4.12/modules/core/src/hal_internal.cpp:301:111: error: too few arguments to function ‘void dgels_(const char*, const int*, const int*, const int*, double*, const int*, double*, const int*, double*, const int*, int*, size_t)’
301 | dgels_(mode, &m, &n, &k, (double*)tmpA, &ldtmpA, (double*)b, &m, (double*)buffer, &lwork, info);
| ^
In file included from /usr/include/lapack.h:11,
from /usr/include/lapacke.h:36,
from /build/src/build/opencv_lapack.h:12,
from /build/src/opencv-3.4.12/modules/core/src/hal_internal.cpp:50:
/usr/include/lapack.h:1525:6: note: declared here
1525 | void LAPACK_dgels_base(
| ^~~~~~~~~~~~~~~~~
/build/src/opencv-3.4.12/modules/core/src/hal_internal.cpp:313:114: error: too few arguments to function ‘void dgels_(const char*, const int*, const int*, const int*, double*, const int*, double*, const int*, double*, const int*, int*, size_t)’
313 | dgels_(mode, &m, &n, &k, (double*)tmpA, &ldtmpA, (double*)tmpB, &m, (double*)&work1, &lwork, info);
| ^
In file included from /usr/include/lapack.h:11,
from /usr/include/lapacke.h:36,
from /build/src/build/opencv_lapack.h:12,
from /build/src/opencv-3.4.12/modules/core/src/hal_internal.cpp:50:
/usr/include/lapack.h:1525:6: note: declared here
1525 | void LAPACK_dgels_base(
| ^~~~~~~~~~~~~~~~~
/build/src/opencv-3.4.12/modules/core/src/hal_internal.cpp:322:114: error: too few arguments to function ‘void dgels_(const char*, const int*, const int*, const int*, double*, const int*, double*, const int*, double*, const int*, int*, size_t)’
322 | dgels_(mode, &m, &n, &k, (double*)tmpA, &ldtmpA, (double*)tmpB, &m, (double*)buffer, &lwork, info);
| ^
In file included from /usr/include/lapack.h:11,
from /usr/include/lapacke.h:36,
from /build/src/build/opencv_lapack.h:12,
from /build/src/opencv-3.4.12/modules/core/src/hal_internal.cpp:50:
/usr/include/lapack.h:1525:6: note: declared here
1525 | void LAPACK_dgels_base(
| ^~~~~~~~~~~~~~~~~
make[2]: *** [modules/core/CMakeFiles/opencv_core.dir/build.make:495: modules/core/CMakeFiles/opencv_core.dir/src/hal_internal.cpp.o] Error 1
make[1]: *** [CMakeFiles/Makefile2:3021: modules/core/CMakeFiles/opencv_core.dir/all] Error 2
make[1]: *** Waiting for unfinished jobs....
make: *** [Makefile:166: all] Error 2
==> ERROR: A failure occurred in build().
Aborting...
No packages were built!