ros-melodic-moveit-ros-planning-interface

Build Status: FAILURE     Last Build Date: 23.3.2021 00:45

Build Output
warning: dependency cycle detected:
warning: harfbuzz will be installed before its freetype2 dependency
warning: dependency cycle detected:
warning: libglvnd will be installed before its mesa dependency
% Total % Received % Xferd Average Speed Time Time Time Current
Dload Upload Total Spent Left Speed

0 0 0 0 0 0 0 0 --:--:-- --:--:-- --:--:-- 0
100 126 100 126 0 0 732 0 --:--:-- --:--:-- --:--:-- 736

100 1218k 0 1218k 0 0 1854k 0 --:--:-- --:--:-- --:--:-- 1854k
100 1839k 0 1839k 0 0 2602k 0 --:--:-- --:--:-- --:--:-- 12.3M
ros-melodic-moveit-ros-planning-interface-1.0.7.tar.gz ... Passed
CMake Warning at /usr/src/gmock/CMakeLists.txt:43 (project):
VERSION keyword not followed by a value or was followed by a value that
expanded to nothing.


CMake Deprecation Warning at /usr/src/gmock/CMakeLists.txt:45 (cmake_minimum_required):
Compatibility with CMake < 2.8.12 will be removed from a future version of
CMake.

Update the VERSION argument <min> value or use a ...<max> suffix to tell
CMake that the project does not need compatibility with older versions.


CMake Warning at /usr/src/googletest/CMakeLists.txt:54 (project):
VERSION keyword not followed by a value or was followed by a value that
expanded to nothing.


CMake Deprecation Warning at /usr/src/googletest/CMakeLists.txt:56 (cmake_minimum_required):
Compatibility with CMake < 2.8.12 will be removed from a future version of
CMake.

Update the VERSION argument <min> value or use a ...<max> suffix to tell
CMake that the project does not need compatibility with older versions.


In file included from /opt/boost1.69/include/boost/python/detail/is_xxx.hpp:8,
from /opt/boost1.69/include/boost/python/detail/is_auto_ptr.hpp:9,
from /opt/boost1.69/include/boost/python/detail/copy_ctor_mutates_rhs.hpp:8,
from /opt/boost1.69/include/boost/python/detail/value_arg.hpp:7,
from /opt/boost1.69/include/boost/python/object/forward.hpp:10,
from /opt/boost1.69/include/boost/python/object/pointer_holder.hpp:16,
from /opt/boost1.69/include/boost/python/to_python_indirect.hpp:10,
from /opt/boost1.69/include/boost/python/converter/arg_to_python.hpp:10,
from /opt/boost1.69/include/boost/python/call.hpp:15,
from /opt/boost1.69/include/boost/python/object_core.hpp:14,
from /opt/boost1.69/include/boost/python/args.hpp:22,
from /opt/boost1.69/include/boost/python.hpp:11,
from /build/src/moveit-1.0.7/moveit_ros/planning_interface/py_bindings_tools/include/moveit/py_bindings_tools/roscpp_initializer.h:40,
from /build/src/moveit-1.0.7/moveit_ros/planning_interface/py_bindings_tools/src/roscpp_initializer.cpp:37:
/opt/boost1.69/include/boost/python/detail/is_auto_ptr.hpp:17:40: warning: ‘template<class> class std::auto_ptr’ is deprecated [-Wdeprecated-declarations]
17 | BOOST_PYTHON_IS_XXX_DEF(auto_ptr, std::auto_ptr, 1)
| ^~~~~~~~
/opt/boost1.69/include/boost/detail/is_xxx.hpp:20:4: note: in definition of macro ‘BOOST_DETAIL_IS_XXX_DEF’
20 | qualified_name< BOOST_PP_ENUM_PARAMS_Z(1, nargs, T) > \
| ^~~~~~~~~~~~~~
/opt/boost1.69/include/boost/python/detail/is_auto_ptr.hpp:17:1: note: in expansion of macro ‘BOOST_PYTHON_IS_XXX_DEF’
17 | BOOST_PYTHON_IS_XXX_DEF(auto_ptr, std::auto_ptr, 1)
| ^~~~~~~~~~~~~~~~~~~~~~~
In file included from /usr/include/c++/10.2.0/memory:83,
from /opt/boost1.69/include/boost/function/function_base.hpp:16,
from /opt/boost1.69/include/boost/function/detail/prologue.hpp:17,
from /opt/boost1.69/include/boost/function/function_template.hpp:13,
from /opt/boost1.69/include/boost/function/detail/maybe_include.hpp:15,
from /opt/boost1.69/include/boost/function/function0.hpp:11,
from /opt/boost1.69/include/boost/python/errors.hpp:13,
from /opt/boost1.69/include/boost/python/handle.hpp:11,
from /opt/boost1.69/include/boost/python/args_fwd.hpp:10,
from /opt/boost1.69/include/boost/python/args.hpp:10,
from /opt/boost1.69/include/boost/python.hpp:11,
from /build/src/moveit-1.0.7/moveit_ros/planning_interface/py_bindings_tools/include/moveit/py_bindings_tools/roscpp_initializer.h:40,
from /build/src/moveit-1.0.7/moveit_ros/planning_interface/py_bindings_tools/src/roscpp_initializer.cpp:37:
/usr/include/c++/10.2.0/bits/unique_ptr.h:57:28: note: declared here
57 | template<typename> class auto_ptr;
| ^~~~~~~~
In file included from /opt/boost1.69/include/boost/preprocessor/iteration/detail/iter/forward1.hpp:47,
from /opt/boost1.69/include/boost/python/call.hpp:33,
from /opt/boost1.69/include/boost/python/object_core.hpp:14,
from /opt/boost1.69/include/boost/python/args.hpp:22,
from /opt/boost1.69/include/boost/python.hpp:11,
from /build/src/moveit-1.0.7/moveit_ros/planning_interface/py_bindings_tools/include/moveit/py_bindings_tools/roscpp_initializer.h:40,
from /build/src/moveit-1.0.7/moveit_ros/planning_interface/py_bindings_tools/src/roscpp_initializer.cpp:37:
/opt/boost1.69/include/boost/python/call.hpp: In function ‘typename boost::python::detail::returnable<T>::type boost::python::call(PyObject*, boost::type<Target>*)’:
/opt/boost1.69/include/boost/python/call.hpp:66:13: warning: ‘PyObject* PyEval_CallFunction(PyObject*, const char*, ...)’ is deprecated [-Wdeprecated-declarations]
66 | BOOST_PP_REPEAT_1ST(N, BOOST_PYTHON_FAST_ARG_TO_PYTHON_GET, nil)
| ^
In file included from /usr/include/python3.9/Python.h:145,
from /opt/boost1.69/include/boost/python/detail/wrap_python.hpp:151,
from /opt/boost1.69/include/boost/python/detail/prefix.hpp:13,
from /opt/boost1.69/include/boost/python/args.hpp:8,
from /opt/boost1.69/include/boost/python.hpp:11,
from /build/src/moveit-1.0.7/moveit_ros/planning_interface/py_bindings_tools/include/moveit/py_bindings_tools/roscpp_initializer.h:40,
from /build/src/moveit-1.0.7/moveit_ros/planning_interface/py_bindings_tools/src/roscpp_initializer.cpp:37:
/usr/include/python3.9/ceval.h:26:43: note: declared here
26 | Py_DEPRECATED(3.9) PyAPI_FUNC(PyObject *) PyEval_CallFunction(
| ^~~~~~~~~~~~~~~~~~~
In file included from /opt/boost1.69/include/boost/preprocessor/iteration/detail/iter/forward1.hpp:47,
from /opt/boost1.69/include/boost/python/call_method.hpp:32,
from /opt/boost1.69/include/boost/python.hpp:17,
from /build/src/moveit-1.0.7/moveit_ros/planning_interface/py_bindings_tools/include/moveit/py_bindings_tools/roscpp_initializer.h:40,
from /build/src/moveit-1.0.7/moveit_ros/planning_interface/py_bindings_tools/src/roscpp_initializer.cpp:37:
/opt/boost1.69/include/boost/python/call_method.hpp: In function ‘typename boost::python::detail::returnable<T>::type boost::python::call_method(PyObject*, const char*, boost::type<Target>*)’:
/opt/boost1.69/include/boost/python/call_method.hpp:66:13: warning: ‘PyObject* PyEval_CallMethod(PyObject*, const char*, const char*, ...)’ is deprecated [-Wdeprecated-declarations]
66 | BOOST_PP_REPEAT_1ST(N, BOOST_PYTHON_FAST_ARG_TO_PYTHON_GET, nil)
| ^
In file included from /usr/include/python3.9/Python.h:145,
from /opt/boost1.69/include/boost/python/detail/wrap_python.hpp:151,
from /opt/boost1.69/include/boost/python/detail/prefix.hpp:13,
from /opt/boost1.69/include/boost/python/args.hpp:8,
from /opt/boost1.69/include/boost/python.hpp:11,
from /build/src/moveit-1.0.7/moveit_ros/planning_interface/py_bindings_tools/include/moveit/py_bindings_tools/roscpp_initializer.h:40,
from /build/src/moveit-1.0.7/moveit_ros/planning_interface/py_bindings_tools/src/roscpp_initializer.cpp:37:
/usr/include/python3.9/ceval.h:28:43: note: declared here
28 | Py_DEPRECATED(3.9) PyAPI_FUNC(PyObject *) PyEval_CallMethod(
| ^~~~~~~~~~~~~~~~~
In file included from /opt/boost1.69/include/boost/python/wrapper.hpp:8,
from /opt/boost1.69/include/boost/python/object/value_holder.hpp:15,
from /opt/boost1.69/include/boost/python/object/class_metadata.hpp:14,
from /opt/boost1.69/include/boost/python/class.hpp:23,
from /opt/boost1.69/include/boost/python.hpp:18,
from /build/src/moveit-1.0.7/moveit_ros/planning_interface/py_bindings_tools/include/moveit/py_bindings_tools/roscpp_initializer.h:40,
from /build/src/moveit-1.0.7/moveit_ros/planning_interface/py_bindings_tools/src/roscpp_initializer.cpp:37:
/opt/boost1.69/include/boost/python/override.hpp: In member function ‘boost::python::detail::method_result boost::python::override::operator()() const’:
/opt/boost1.69/include/boost/python/override.hpp:103:13: warning: ‘PyObject* PyEval_CallFunction(PyObject*, const char*, ...)’ is deprecated [-Wdeprecated-declarations]
103 | ));
| ^
In file included from /usr/include/python3.9/Python.h:145,
from /opt/boost1.69/include/boost/python/detail/wrap_python.hpp:151,
from /opt/boost1.69/include/boost/python/detail/prefix.hpp:13,
from /opt/boost1.69/include/boost/python/args.hpp:8,
from /opt/boost1.69/include/boost/python.hpp:11,
from /build/src/moveit-1.0.7/moveit_ros/planning_interface/py_bindings_tools/include/moveit/py_bindings_tools/roscpp_initializer.h:40,
from /build/src/moveit-1.0.7/moveit_ros/planning_interface/py_bindings_tools/src/roscpp_initializer.cpp:37:
/usr/include/python3.9/ceval.h:26:43: note: declared here
26 | Py_DEPRECATED(3.9) PyAPI_FUNC(PyObject *) PyEval_CallFunction(
| ^~~~~~~~~~~~~~~~~~~
In file included from /opt/boost1.69/include/boost/config/header_deprecated.hpp:18,
from /opt/boost1.69/include/boost/pending/integer_log2.hpp:5,
from /opt/boost1.69/include/boost/random/detail/integer_log2.hpp:19,
from /opt/boost1.69/include/boost/random/detail/large_arithmetic.hpp:19,
from /opt/boost1.69/include/boost/random/detail/const_mod.hpp:23,
from /opt/boost1.69/include/boost/random/detail/seed_impl.hpp:26,
from /opt/boost1.69/include/boost/random/mersenne_twister.hpp:30,
from /opt/ros/melodic/include/random_numbers/random_numbers.h:40,
from /opt/ros/melodic/include/moveit/robot_model/joint_model.h:46,
from /opt/ros/melodic/include/moveit/robot_model/joint_model_group.h:41,
from /opt/ros/melodic/include/moveit/robot_model/robot_model.h:47,
from /opt/ros/melodic/include/moveit/robot_state/robot_state.h:41,
from /opt/ros/melodic/include/moveit/planning_scene_monitor/current_state_monitor.h:42,
from /build/src/moveit-1.0.7/moveit_ros/planning_interface/common_planning_interface_objects/include/moveit/common_planning_interface_objects/common_objects.h:40,
from /build/src/moveit-1.0.7/moveit_ros/planning_interface/common_planning_interface_objects/src/common_objects.cpp:37:
/opt/boost1.69/include/boost/config/pragma_message.hpp:24:34: note: ‘#pragma message: This header is deprecated. Use <boost/integer/integer_log2.hpp> instead.’
24 | # define BOOST_PRAGMA_MESSAGE(x) _Pragma(BOOST_STRINGIZE(message(x)))
| ^~~~~~~
/opt/boost1.69/include/boost/config/pragma_message.hpp:24:34: note: in definition of macro ‘BOOST_PRAGMA_MESSAGE’
24 | # define BOOST_PRAGMA_MESSAGE(x) _Pragma(BOOST_STRINGIZE(message(x)))
| ^~~~~~~
/opt/boost1.69/include/boost/pending/integer_log2.hpp:7:1: note: in expansion of macro ‘BOOST_HEADER_DEPRECATED’
7 | BOOST_HEADER_DEPRECATED("<boost/integer/integer_log2.hpp>");
| ^~~~~~~~~~~~~~~~~~~~~~~
In file included from /opt/boost1.69/include/boost/python/detail/is_xxx.hpp:8,
from /opt/boost1.69/include/boost/python/detail/is_auto_ptr.hpp:9,
from /opt/boost1.69/include/boost/python/detail/copy_ctor_mutates_rhs.hpp:8,
from /opt/boost1.69/include/boost/python/detail/value_arg.hpp:7,
from /opt/boost1.69/include/boost/python/object/forward.hpp:10,
from /opt/boost1.69/include/boost/python/object/pointer_holder.hpp:16,
from /opt/boost1.69/include/boost/python/to_python_indirect.hpp:10,
from /opt/boost1.69/include/boost/python/converter/arg_to_python.hpp:10,
from /opt/boost1.69/include/boost/python/call.hpp:15,
from /opt/boost1.69/include/boost/python/object_core.hpp:14,
from /opt/boost1.69/include/boost/python/args.hpp:22,
from /opt/boost1.69/include/boost/python.hpp:11,
from /build/src/moveit-1.0.7/moveit_ros/planning_interface/test/serialize_msg_python_cpp_helpers.cpp:38:
/opt/boost1.69/include/boost/python/detail/is_auto_ptr.hpp:17:40: warning: ‘template<class> class std::auto_ptr’ is deprecated [-Wdeprecated-declarations]
17 | BOOST_PYTHON_IS_XXX_DEF(auto_ptr, std::auto_ptr, 1)
| ^~~~~~~~
/opt/boost1.69/include/boost/detail/is_xxx.hpp:20:4: note: in definition of macro ‘BOOST_DETAIL_IS_XXX_DEF’
20 | qualified_name< BOOST_PP_ENUM_PARAMS_Z(1, nargs, T) > \
| ^~~~~~~~~~~~~~
/opt/boost1.69/include/boost/python/detail/is_auto_ptr.hpp:17:1: note: in expansion of macro ‘BOOST_PYTHON_IS_XXX_DEF’
17 | BOOST_PYTHON_IS_XXX_DEF(auto_ptr, std::auto_ptr, 1)
| ^~~~~~~~~~~~~~~~~~~~~~~
In file included from /usr/include/c++/10.2.0/memory:83,
from /opt/boost1.69/include/boost/function/function_base.hpp:16,
from /opt/boost1.69/include/boost/function/detail/prologue.hpp:17,
from /opt/boost1.69/include/boost/function/function_template.hpp:13,
from /opt/boost1.69/include/boost/function/detail/maybe_include.hpp:15,
from /opt/boost1.69/include/boost/function/function0.hpp:11,
from /opt/boost1.69/include/boost/python/errors.hpp:13,
from /opt/boost1.69/include/boost/python/handle.hpp:11,
from /opt/boost1.69/include/boost/python/args_fwd.hpp:10,
from /opt/boost1.69/include/boost/python/args.hpp:10,
from /opt/boost1.69/include/boost/python.hpp:11,
from /build/src/moveit-1.0.7/moveit_ros/planning_interface/test/serialize_msg_python_cpp_helpers.cpp:38:
/usr/include/c++/10.2.0/bits/unique_ptr.h:57:28: note: declared here
57 | template<typename> class auto_ptr;
| ^~~~~~~~
In file included from /opt/boost1.69/include/boost/preprocessor/iteration/detail/iter/forward1.hpp:47,
from /opt/boost1.69/include/boost/python/call.hpp:33,
from /opt/boost1.69/include/boost/python/object_core.hpp:14,
from /opt/boost1.69/include/boost/python/args.hpp:22,
from /opt/boost1.69/include/boost/python.hpp:11,
from /build/src/moveit-1.0.7/moveit_ros/planning_interface/test/serialize_msg_python_cpp_helpers.cpp:38:
/opt/boost1.69/include/boost/python/call.hpp: In function ‘typename boost::python::detail::returnable<T>::type boost::python::call(PyObject*, boost::type<Target>*)’:
/opt/boost1.69/include/boost/python/call.hpp:66:13: warning: ‘PyObject* PyEval_CallFunction(PyObject*, const char*, ...)’ is deprecated [-Wdeprecated-declarations]
66 | BOOST_PP_REPEAT_1ST(N, BOOST_PYTHON_FAST_ARG_TO_PYTHON_GET, nil)
| ^
In file included from /usr/include/python3.9/Python.h:145,
from /build/src/moveit-1.0.7/moveit_ros/planning_interface/test/serialize_msg_python_cpp_helpers.cpp:37:
/usr/include/python3.9/ceval.h:26:43: note: declared here
26 | Py_DEPRECATED(3.9) PyAPI_FUNC(PyObject *) PyEval_CallFunction(
| ^~~~~~~~~~~~~~~~~~~
In file included from /opt/boost1.69/include/boost/preprocessor/iteration/detail/iter/forward1.hpp:47,
from /opt/boost1.69/include/boost/python/call_method.hpp:32,
from /opt/boost1.69/include/boost/python.hpp:17,
from /build/src/moveit-1.0.7/moveit_ros/planning_interface/test/serialize_msg_python_cpp_helpers.cpp:38:
/opt/boost1.69/include/boost/python/call_method.hpp: In function ‘typename boost::python::detail::returnable<T>::type boost::python::call_method(PyObject*, const char*, boost::type<Target>*)’:
/opt/boost1.69/include/boost/python/call_method.hpp:66:13: warning: ‘PyObject* PyEval_CallMethod(PyObject*, const char*, const char*, ...)’ is deprecated [-Wdeprecated-declarations]
66 | BOOST_PP_REPEAT_1ST(N, BOOST_PYTHON_FAST_ARG_TO_PYTHON_GET, nil)
| ^
In file included from /usr/include/python3.9/Python.h:145,
from /build/src/moveit-1.0.7/moveit_ros/planning_interface/test/serialize_msg_python_cpp_helpers.cpp:37:
/usr/include/python3.9/ceval.h:28:43: note: declared here
28 | Py_DEPRECATED(3.9) PyAPI_FUNC(PyObject *) PyEval_CallMethod(
| ^~~~~~~~~~~~~~~~~
In file included from /opt/boost1.69/include/boost/python/wrapper.hpp:8,
from /opt/boost1.69/include/boost/python/object/value_holder.hpp:15,
from /opt/boost1.69/include/boost/python/object/class_metadata.hpp:14,
from /opt/boost1.69/include/boost/python/class.hpp:23,
from /opt/boost1.69/include/boost/python.hpp:18,
from /build/src/moveit-1.0.7/moveit_ros/planning_interface/test/serialize_msg_python_cpp_helpers.cpp:38:
/opt/boost1.69/include/boost/python/override.hpp: In member function ‘boost::python::detail::method_result boost::python::override::operator()() const’:
/opt/boost1.69/include/boost/python/override.hpp:103:13: warning: ‘PyObject* PyEval_CallFunction(PyObject*, const char*, ...)’ is deprecated [-Wdeprecated-declarations]
103 | ));
| ^
In file included from /usr/include/python3.9/Python.h:145,
from /build/src/moveit-1.0.7/moveit_ros/planning_interface/test/serialize_msg_python_cpp_helpers.cpp:37:
/usr/include/python3.9/ceval.h:26:43: note: declared here
26 | Py_DEPRECATED(3.9) PyAPI_FUNC(PyObject *) PyEval_CallFunction(
| ^~~~~~~~~~~~~~~~~~~
In file included from /opt/boost1.69/include/boost/config/header_deprecated.hpp:18,
from /opt/boost1.69/include/boost/pending/integer_log2.hpp:5,
from /opt/boost1.69/include/boost/random/detail/integer_log2.hpp:19,
from /opt/boost1.69/include/boost/random/detail/large_arithmetic.hpp:19,
from /opt/boost1.69/include/boost/random/detail/const_mod.hpp:23,
from /opt/boost1.69/include/boost/random/detail/seed_impl.hpp:26,
from /opt/boost1.69/include/boost/random/mersenne_twister.hpp:30,
from /opt/ros/melodic/include/random_numbers/random_numbers.h:40,
from /opt/ros/melodic/include/moveit/robot_model/joint_model.h:46,
from /opt/ros/melodic/include/moveit/robot_model/joint_model_group.h:41,
from /opt/ros/melodic/include/moveit/robot_model/robot_model.h:47,
from /opt/ros/melodic/include/moveit/robot_state/robot_state.h:41,
from /opt/ros/melodic/include/moveit/planning_scene_monitor/current_state_monitor.h:42,
from /build/src/moveit-1.0.7/moveit_ros/planning_interface/common_planning_interface_objects/include/moveit/common_planning_interface_objects/common_objects.h:40,
from /build/src/moveit-1.0.7/moveit_ros/planning_interface/robot_interface/src/wrap_python_robot_interface.cpp:37:
/opt/boost1.69/include/boost/config/pragma_message.hpp:24:34: note: ‘#pragma message: This header is deprecated. Use <boost/integer/integer_log2.hpp> instead.’
24 | # define BOOST_PRAGMA_MESSAGE(x) _Pragma(BOOST_STRINGIZE(message(x)))
| ^~~~~~~
/opt/boost1.69/include/boost/config/pragma_message.hpp:24:34: note: in definition of macro ‘BOOST_PRAGMA_MESSAGE’
24 | # define BOOST_PRAGMA_MESSAGE(x) _Pragma(BOOST_STRINGIZE(message(x)))
| ^~~~~~~
/opt/boost1.69/include/boost/pending/integer_log2.hpp:7:1: note: in expansion of macro ‘BOOST_HEADER_DEPRECATED’
7 | BOOST_HEADER_DEPRECATED("<boost/integer/integer_log2.hpp>");
| ^~~~~~~~~~~~~~~~~~~~~~~
In file included from /opt/boost1.69/include/boost/parameter/parameters.hpp:9,
from /opt/boost1.69/include/boost/parameter.hpp:11,
from /opt/boost1.69/include/boost/signals2/signal_type.hpp:32,
from /opt/boost1.69/include/boost/signals2.hpp:20,
from /opt/ros/melodic/include/tf2/buffer_core.h:37,
from /opt/ros/melodic/include/tf2_ros/buffer_interface.h:35,
from /opt/ros/melodic/include/tf2_ros/buffer.h:35,
from /opt/ros/melodic/include/moveit/planning_scene_monitor/current_state_monitor.h:41,
from /build/src/moveit-1.0.7/moveit_ros/planning_interface/common_planning_interface_objects/include/moveit/common_planning_interface_objects/common_objects.h:40,
from /build/src/moveit-1.0.7/moveit_ros/planning_interface/robot_interface/src/wrap_python_robot_interface.cpp:37:
/opt/boost1.69/include/boost/python/detail/is_auto_ptr.hpp:17:40: warning: ‘template<class> class std::auto_ptr’ is deprecated [-Wdeprecated-declarations]
17 | BOOST_PYTHON_IS_XXX_DEF(auto_ptr, std::auto_ptr, 1)
| ^~~~~~~~
/opt/boost1.69/include/boost/detail/is_xxx.hpp:20:4: note: in definition of macro ‘BOOST_DETAIL_IS_XXX_DEF’
20 | qualified_name< BOOST_PP_ENUM_PARAMS_Z(1, nargs, T) > \
| ^~~~~~~~~~~~~~
/opt/boost1.69/include/boost/python/detail/is_auto_ptr.hpp:17:1: note: in expansion of macro ‘BOOST_PYTHON_IS_XXX_DEF’
17 | BOOST_PYTHON_IS_XXX_DEF(auto_ptr, std::auto_ptr, 1)
| ^~~~~~~~~~~~~~~~~~~~~~~
In file included from /usr/include/c++/10.2.0/bits/locale_conv.h:41,
from /usr/include/c++/10.2.0/locale:43,
from /usr/include/c++/10.2.0/iomanip:43,
from /opt/boost1.69/include/boost/math/policies/error_handling.hpp:12,
from /opt/boost1.69/include/boost/math/special_functions/round.hpp:14,
from /opt/ros/melodic/include/ros/time.h:58,
from /opt/ros/melodic/include/ros/ros.h:38,
from /opt/ros/melodic/include/moveit/planning_scene_monitor/current_state_monitor.h:40,
from /build/src/moveit-1.0.7/moveit_ros/planning_interface/common_planning_interface_objects/include/moveit/common_planning_interface_objects/common_objects.h:40,
from /build/src/moveit-1.0.7/moveit_ros/planning_interface/robot_interface/src/wrap_python_robot_interface.cpp:37:
/usr/include/c++/10.2.0/bits/unique_ptr.h:57:28: note: declared here
57 | template<typename> class auto_ptr;
| ^~~~~~~~
In file included from /opt/boost1.69/include/boost/preprocessor/iteration/detail/iter/forward1.hpp:47,
from /opt/boost1.69/include/boost/python/call.hpp:33,
from /opt/boost1.69/include/boost/python/object_core.hpp:14,
from /opt/boost1.69/include/boost/python/args.hpp:22,
from /opt/boost1.69/include/boost/python.hpp:11,
from /build/src/moveit-1.0.7/moveit_ros/planning_interface/py_bindings_tools/include/moveit/py_bindings_tools/roscpp_initializer.h:40,
from /build/src/moveit-1.0.7/moveit_ros/planning_interface/robot_interface/src/wrap_python_robot_interface.cpp:39:
/opt/boost1.69/include/boost/python/call.hpp: In function ‘typename boost::python::detail::returnable<T>::type boost::python::call(PyObject*, boost::type<R>*)’:
/opt/boost1.69/include/boost/python/call.hpp:66:13: warning: ‘PyObject* PyEval_CallFunction(PyObject*, const char*, ...)’ is deprecated [-Wdeprecated-declarations]
66 | BOOST_PP_REPEAT_1ST(N, BOOST_PYTHON_FAST_ARG_TO_PYTHON_GET, nil)
| ^
In file included from /usr/include/python3.9/Python.h:145,
from /opt/boost1.69/include/boost/python/detail/wrap_python.hpp:151,
from /opt/boost1.69/include/boost/python/detail/prefix.hpp:13,
from /opt/boost1.69/include/boost/python/args.hpp:8,
from /opt/boost1.69/include/boost/python.hpp:11,
from /build/src/moveit-1.0.7/moveit_ros/planning_interface/py_bindings_tools/include/moveit/py_bindings_tools/roscpp_initializer.h:40,
from /build/src/moveit-1.0.7/moveit_ros/planning_interface/robot_interface/src/wrap_python_robot_interface.cpp:39:
/usr/include/python3.9/ceval.h:26:43: note: declared here
26 | Py_DEPRECATED(3.9) PyAPI_FUNC(PyObject *) PyEval_CallFunction(
| ^~~~~~~~~~~~~~~~~~~
In file included from /opt/boost1.69/include/boost/preprocessor/iteration/detail/iter/forward1.hpp:47,
from /opt/boost1.69/include/boost/python/call_method.hpp:32,
from /opt/boost1.69/include/boost/python.hpp:17,
from /build/src/moveit-1.0.7/moveit_ros/planning_interface/py_bindings_tools/include/moveit/py_bindings_tools/roscpp_initializer.h:40,
from /build/src/moveit-1.0.7/moveit_ros/planning_interface/robot_interface/src/wrap_python_robot_interface.cpp:39:
/opt/boost1.69/include/boost/python/call_method.hpp: In function ‘typename boost::python::detail::returnable<T>::type boost::python::call_method(PyObject*, const char*, boost::type<R>*)’:
/opt/boost1.69/include/boost/python/call_method.hpp:66:13: warning: ‘PyObject* PyEval_CallMethod(PyObject*, const char*, const char*, ...)’ is deprecated [-Wdeprecated-declarations]
66 | BOOST_PP_REPEAT_1ST(N, BOOST_PYTHON_FAST_ARG_TO_PYTHON_GET, nil)
| ^
In file included from /usr/include/python3.9/Python.h:145,
from /opt/boost1.69/include/boost/python/detail/wrap_python.hpp:151,
from /opt/boost1.69/include/boost/python/detail/prefix.hpp:13,
from /opt/boost1.69/include/boost/python/args.hpp:8,
from /opt/boost1.69/include/boost/python.hpp:11,
from /build/src/moveit-1.0.7/moveit_ros/planning_interface/py_bindings_tools/include/moveit/py_bindings_tools/roscpp_initializer.h:40,
from /build/src/moveit-1.0.7/moveit_ros/planning_interface/robot_interface/src/wrap_python_robot_interface.cpp:39:
/usr/include/python3.9/ceval.h:28:43: note: declared here
28 | Py_DEPRECATED(3.9) PyAPI_FUNC(PyObject *) PyEval_CallMethod(
| ^~~~~~~~~~~~~~~~~
In file included from /opt/boost1.69/include/boost/python/wrapper.hpp:8,
from /opt/boost1.69/include/boost/python/object/value_holder.hpp:15,
from /opt/boost1.69/include/boost/python/object/class_metadata.hpp:14,
from /opt/boost1.69/include/boost/python/class.hpp:23,
from /opt/boost1.69/include/boost/python.hpp:18,
from /build/src/moveit-1.0.7/moveit_ros/planning_interface/py_bindings_tools/include/moveit/py_bindings_tools/roscpp_initializer.h:40,
from /build/src/moveit-1.0.7/moveit_ros/planning_interface/robot_interface/src/wrap_python_robot_interface.cpp:39:
/opt/boost1.69/include/boost/python/override.hpp: In member function ‘boost::python::detail::method_result boost::python::override::operator()() const’:
/opt/boost1.69/include/boost/python/override.hpp:103:13: warning: ‘PyObject* PyEval_CallFunction(PyObject*, const char*, ...)’ is deprecated [-Wdeprecated-declarations]
103 | ));
| ^
In file included from /usr/include/python3.9/Python.h:145,
from /opt/boost1.69/include/boost/python/detail/wrap_python.hpp:151,
from /opt/boost1.69/include/boost/python/detail/prefix.hpp:13,
from /opt/boost1.69/include/boost/python/args.hpp:8,
from /opt/boost1.69/include/boost/python.hpp:11,
from /build/src/moveit-1.0.7/moveit_ros/planning_interface/py_bindings_tools/include/moveit/py_bindings_tools/roscpp_initializer.h:40,
from /build/src/moveit-1.0.7/moveit_ros/planning_interface/robot_interface/src/wrap_python_robot_interface.cpp:39:
/usr/include/python3.9/ceval.h:26:43: note: declared here
26 | Py_DEPRECATED(3.9) PyAPI_FUNC(PyObject *) PyEval_CallFunction(
| ^~~~~~~~~~~~~~~~~~~
In file included from /opt/boost1.69/include/boost/python/detail/is_xxx.hpp:8,
from /opt/boost1.69/include/boost/python/detail/is_auto_ptr.hpp:9,
from /opt/boost1.69/include/boost/python/detail/copy_ctor_mutates_rhs.hpp:8,
from /opt/boost1.69/include/boost/python/detail/value_arg.hpp:7,
from /opt/boost1.69/include/boost/python/object/forward.hpp:10,
from /opt/boost1.69/include/boost/python/object/pointer_holder.hpp:16,
from /opt/boost1.69/include/boost/python/to_python_indirect.hpp:10,
from /opt/boost1.69/include/boost/python/converter/arg_to_python.hpp:10,
from /opt/boost1.69/include/boost/python/call.hpp:15,
from /opt/boost1.69/include/boost/python/object_core.hpp:14,
from /opt/boost1.69/include/boost/python/args.hpp:22,
from /opt/boost1.69/include/boost/python.hpp:11,
from /build/src/moveit-1.0.7/moveit_ros/planning_interface/py_bindings_tools/include/moveit/py_bindings_tools/roscpp_initializer.h:40,
from /build/src/moveit-1.0.7/moveit_ros/planning_interface/py_bindings_tools/src/wrap_python_roscpp_initializer.cpp:37:
/opt/boost1.69/include/boost/python/detail/is_auto_ptr.hpp:17:40: warning: ‘template<class> class std::auto_ptr’ is deprecated [-Wdeprecated-declarations]
17 | BOOST_PYTHON_IS_XXX_DEF(auto_ptr, std::auto_ptr, 1)
| ^~~~~~~~
/opt/boost1.69/include/boost/detail/is_xxx.hpp:20:4: note: in definition of macro ‘BOOST_DETAIL_IS_XXX_DEF’
20 | qualified_name< BOOST_PP_ENUM_PARAMS_Z(1, nargs, T) > \
| ^~~~~~~~~~~~~~
/opt/boost1.69/include/boost/python/detail/is_auto_ptr.hpp:17:1: note: in expansion of macro ‘BOOST_PYTHON_IS_XXX_DEF’
17 | BOOST_PYTHON_IS_XXX_DEF(auto_ptr, std::auto_ptr, 1)
| ^~~~~~~~~~~~~~~~~~~~~~~
In file included from /usr/include/c++/10.2.0/memory:83,
from /opt/boost1.69/include/boost/function/function_base.hpp:16,
from /opt/boost1.69/include/boost/function/detail/prologue.hpp:17,
from /opt/boost1.69/include/boost/function/function_template.hpp:13,
from /opt/boost1.69/include/boost/function/detail/maybe_include.hpp:15,
from /opt/boost1.69/include/boost/function/function0.hpp:11,
from /opt/boost1.69/include/boost/python/errors.hpp:13,
from /opt/boost1.69/include/boost/python/handle.hpp:11,
from /opt/boost1.69/include/boost/python/args_fwd.hpp:10,
from /opt/boost1.69/include/boost/python/args.hpp:10,
from /opt/boost1.69/include/boost/python.hpp:11,
from /build/src/moveit-1.0.7/moveit_ros/planning_interface/py_bindings_tools/include/moveit/py_bindings_tools/roscpp_initializer.h:40,
from /build/src/moveit-1.0.7/moveit_ros/planning_interface/py_bindings_tools/src/wrap_python_roscpp_initializer.cpp:37:
/usr/include/c++/10.2.0/bits/unique_ptr.h:57:28: note: declared here
57 | template<typename> class auto_ptr;
| ^~~~~~~~
In file included from /opt/boost1.69/include/boost/preprocessor/iteration/detail/iter/forward1.hpp:47,
from /opt/boost1.69/include/boost/python/call.hpp:33,
from /opt/boost1.69/include/boost/python/object_core.hpp:14,
from /opt/boost1.69/include/boost/python/args.hpp:22,
from /opt/boost1.69/include/boost/python.hpp:11,
from /build/src/moveit-1.0.7/moveit_ros/planning_interface/py_bindings_tools/include/moveit/py_bindings_tools/roscpp_initializer.h:40,
from /build/src/moveit-1.0.7/moveit_ros/planning_interface/py_bindings_tools/src/wrap_python_roscpp_initializer.cpp:37:
/opt/boost1.69/include/boost/python/call.hpp: In function ‘typename boost::python::detail::returnable<T>::type boost::python::call(PyObject*, boost::type<Target>*)’:
/opt/boost1.69/include/boost/python/call.hpp:66:13: warning: ‘PyObject* PyEval_CallFunction(PyObject*, const char*, ...)’ is deprecated [-Wdeprecated-declarations]
66 | BOOST_PP_REPEAT_1ST(N, BOOST_PYTHON_FAST_ARG_TO_PYTHON_GET, nil)
| ^
In file included from /usr/include/python3.9/Python.h:145,
from /opt/boost1.69/include/boost/python/detail/wrap_python.hpp:151,
from /opt/boost1.69/include/boost/python/detail/prefix.hpp:13,
from /opt/boost1.69/include/boost/python/args.hpp:8,
from /opt/boost1.69/include/boost/python.hpp:11,
from /build/src/moveit-1.0.7/moveit_ros/planning_interface/py_bindings_tools/include/moveit/py_bindings_tools/roscpp_initializer.h:40,
from /build/src/moveit-1.0.7/moveit_ros/planning_interface/py_bindings_tools/src/wrap_python_roscpp_initializer.cpp:37:
/usr/include/python3.9/ceval.h:26:43: note: declared here
26 | Py_DEPRECATED(3.9) PyAPI_FUNC(PyObject *) PyEval_CallFunction(
| ^~~~~~~~~~~~~~~~~~~
In file included from /opt/boost1.69/include/boost/preprocessor/iteration/detail/iter/forward1.hpp:47,
from /opt/boost1.69/include/boost/python/call_method.hpp:32,
from /opt/boost1.69/include/boost/python.hpp:17,
from /build/src/moveit-1.0.7/moveit_ros/planning_interface/py_bindings_tools/include/moveit/py_bindings_tools/roscpp_initializer.h:40,
from /build/src/moveit-1.0.7/moveit_ros/planning_interface/py_bindings_tools/src/wrap_python_roscpp_initializer.cpp:37:
/opt/boost1.69/include/boost/python/call_method.hpp: In function ‘typename boost::python::detail::returnable<T>::type boost::python::call_method(PyObject*, const char*, boost::type<Target>*)’:
/opt/boost1.69/include/boost/python/call_method.hpp:66:13: warning: ‘PyObject* PyEval_CallMethod(PyObject*, const char*, const char*, ...)’ is deprecated [-Wdeprecated-declarations]
66 | BOOST_PP_REPEAT_1ST(N, BOOST_PYTHON_FAST_ARG_TO_PYTHON_GET, nil)
| ^
In file included from /usr/include/python3.9/Python.h:145,
from /opt/boost1.69/include/boost/python/detail/wrap_python.hpp:151,
from /opt/boost1.69/include/boost/python/detail/prefix.hpp:13,
from /opt/boost1.69/include/boost/python/args.hpp:8,
from /opt/boost1.69/include/boost/python.hpp:11,
from /build/src/moveit-1.0.7/moveit_ros/planning_interface/py_bindings_tools/include/moveit/py_bindings_tools/roscpp_initializer.h:40,
from /build/src/moveit-1.0.7/moveit_ros/planning_interface/py_bindings_tools/src/wrap_python_roscpp_initializer.cpp:37:
/usr/include/python3.9/ceval.h:28:43: note: declared here
28 | Py_DEPRECATED(3.9) PyAPI_FUNC(PyObject *) PyEval_CallMethod(
| ^~~~~~~~~~~~~~~~~
In file included from /opt/boost1.69/include/boost/python/wrapper.hpp:8,
from /opt/boost1.69/include/boost/python/object/value_holder.hpp:15,
from /opt/boost1.69/include/boost/python/object/class_metadata.hpp:14,
from /opt/boost1.69/include/boost/python/class.hpp:23,
from /opt/boost1.69/include/boost/python.hpp:18,
from /build/src/moveit-1.0.7/moveit_ros/planning_interface/py_bindings_tools/include/moveit/py_bindings_tools/roscpp_initializer.h:40,
from /build/src/moveit-1.0.7/moveit_ros/planning_interface/py_bindings_tools/src/wrap_python_roscpp_initializer.cpp:37:
/opt/boost1.69/include/boost/python/override.hpp: In member function ‘boost::python::detail::method_result boost::python::override::operator()() const’:
/opt/boost1.69/include/boost/python/override.hpp:103:13: warning: ‘PyObject* PyEval_CallFunction(PyObject*, const char*, ...)’ is deprecated [-Wdeprecated-declarations]
103 | ));
| ^
In file included from /usr/include/python3.9/Python.h:145,
from /opt/boost1.69/include/boost/python/detail/wrap_python.hpp:151,
from /opt/boost1.69/include/boost/python/detail/prefix.hpp:13,
from /opt/boost1.69/include/boost/python/args.hpp:8,
from /opt/boost1.69/include/boost/python.hpp:11,
from /build/src/moveit-1.0.7/moveit_ros/planning_interface/py_bindings_tools/include/moveit/py_bindings_tools/roscpp_initializer.h:40,
from /build/src/moveit-1.0.7/moveit_ros/planning_interface/py_bindings_tools/src/wrap_python_roscpp_initializer.cpp:37:
/usr/include/python3.9/ceval.h:26:43: note: declared here
26 | Py_DEPRECATED(3.9) PyAPI_FUNC(PyObject *) PyEval_CallFunction(
| ^~~~~~~~~~~~~~~~~~~
In file included from /opt/boost1.69/include/boost/config/header_deprecated.hpp:18,
from /opt/boost1.69/include/boost/pending/integer_log2.hpp:5,
from /opt/boost1.69/include/boost/random/detail/integer_log2.hpp:19,
from /opt/boost1.69/include/boost/random/detail/large_arithmetic.hpp:19,
from /opt/boost1.69/include/boost/random/detail/const_mod.hpp:23,
from /opt/boost1.69/include/boost/random/detail/seed_impl.hpp:26,
from /opt/boost1.69/include/boost/random/mersenne_twister.hpp:30,
from /opt/ros/melodic/include/random_numbers/random_numbers.h:40,
from /opt/ros/melodic/include/moveit/robot_model/joint_model.h:46,
from /opt/ros/melodic/include/moveit/robot_model/joint_model_group.h:41,
from /opt/ros/melodic/include/moveit/robot_model/robot_model.h:47,
from /opt/ros/melodic/include/moveit/robot_state/robot_state.h:41,
from /build/src/moveit-1.0.7/moveit_ros/planning_interface/planning_scene_interface/include/moveit/planning_scene_interface/planning_scene_interface.h:41,
from /build/src/moveit-1.0.7/moveit_ros/planning_interface/planning_scene_interface/src/planning_scene_interface.cpp:37:
/opt/boost1.69/include/boost/config/pragma_message.hpp:24:34: note: ‘#pragma message: This header is deprecated. Use <boost/integer/integer_log2.hpp> instead.’
24 | # define BOOST_PRAGMA_MESSAGE(x) _Pragma(BOOST_STRINGIZE(message(x)))
| ^~~~~~~
/opt/boost1.69/include/boost/config/pragma_message.hpp:24:34: note: in definition of macro ‘BOOST_PRAGMA_MESSAGE’
24 | # define BOOST_PRAGMA_MESSAGE(x) _Pragma(BOOST_STRINGIZE(message(x)))
| ^~~~~~~
/opt/boost1.69/include/boost/pending/integer_log2.hpp:7:1: note: in expansion of macro ‘BOOST_HEADER_DEPRECATED’
7 | BOOST_HEADER_DEPRECATED("<boost/integer/integer_log2.hpp>");
| ^~~~~~~~~~~~~~~~~~~~~~~
In file included from /opt/boost1.69/include/boost/config/header_deprecated.hpp:18,
from /opt/boost1.69/include/boost/pending/integer_log2.hpp:5,
from /opt/boost1.69/include/boost/random/detail/integer_log2.hpp:19,
from /opt/boost1.69/include/boost/random/detail/large_arithmetic.hpp:19,
from /opt/boost1.69/include/boost/random/detail/const_mod.hpp:23,
from /opt/boost1.69/include/boost/random/detail/seed_impl.hpp:26,
from /opt/boost1.69/include/boost/random/mersenne_twister.hpp:30,
from /opt/ros/melodic/include/random_numbers/random_numbers.h:40,
from /opt/ros/melodic/include/moveit/robot_model/joint_model.h:46,
from /opt/ros/melodic/include/moveit/robot_model/joint_model_group.h:41,
from /opt/ros/melodic/include/moveit/robot_model/robot_model.h:47,
from /opt/ros/melodic/include/moveit/robot_state/robot_state.h:41,
from /opt/ros/melodic/include/moveit/kinematic_constraints/utils.h:44,
from /build/src/moveit-1.0.7/moveit_ros/planning_interface/move_group_interface/src/move_group_interface.cpp:43:
/opt/boost1.69/include/boost/config/pragma_message.hpp:24:34: note: ‘#pragma message: This header is deprecated. Use <boost/integer/integer_log2.hpp> instead.’
24 | # define BOOST_PRAGMA_MESSAGE(x) _Pragma(BOOST_STRINGIZE(message(x)))
| ^~~~~~~
/opt/boost1.69/include/boost/config/pragma_message.hpp:24:34: note: in definition of macro ‘BOOST_PRAGMA_MESSAGE’
24 | # define BOOST_PRAGMA_MESSAGE(x) _Pragma(BOOST_STRINGIZE(message(x)))
| ^~~~~~~
/opt/boost1.69/include/boost/pending/integer_log2.hpp:7:1: note: in expansion of macro ‘BOOST_HEADER_DEPRECATED’
7 | BOOST_HEADER_DEPRECATED("<boost/integer/integer_log2.hpp>");
| ^~~~~~~~~~~~~~~~~~~~~~~
In file included from /opt/boost1.69/include/boost/config/header_deprecated.hpp:18,
from /opt/boost1.69/include/boost/pending/integer_log2.hpp:5,
from /opt/boost1.69/include/boost/random/detail/integer_log2.hpp:19,
from /opt/boost1.69/include/boost/random/detail/large_arithmetic.hpp:19,
from /opt/boost1.69/include/boost/random/detail/const_mod.hpp:23,
from /opt/boost1.69/include/boost/random/detail/seed_impl.hpp:26,
from /opt/boost1.69/include/boost/random/mersenne_twister.hpp:30,
from /opt/ros/melodic/include/random_numbers/random_numbers.h:40,
from /opt/ros/melodic/include/moveit/robot_model/joint_model.h:46,
from /opt/ros/melodic/include/moveit/robot_model/joint_model_group.h:41,
from /opt/ros/melodic/include/moveit/robot_model/robot_model.h:47,
from /opt/ros/melodic/include/moveit/robot_state/robot_state.h:41,
from /build/src/moveit-1.0.7/moveit_ros/planning_interface/planning_scene_interface/include/moveit/planning_scene_interface/planning_scene_interface.h:41,
from /build/src/moveit-1.0.7/moveit_ros/planning_interface/planning_scene_interface/src/wrap_python_planning_scene_interface.cpp:37:
/opt/boost1.69/include/boost/config/pragma_message.hpp:24:34: note: ‘#pragma message: This header is deprecated. Use <boost/integer/integer_log2.hpp> instead.’
24 | # define BOOST_PRAGMA_MESSAGE(x) _Pragma(BOOST_STRINGIZE(message(x)))
| ^~~~~~~
/opt/boost1.69/include/boost/config/pragma_message.hpp:24:34: note: in definition of macro ‘BOOST_PRAGMA_MESSAGE’
24 | # define BOOST_PRAGMA_MESSAGE(x) _Pragma(BOOST_STRINGIZE(message(x)))
| ^~~~~~~
/opt/boost1.69/include/boost/pending/integer_log2.hpp:7:1: note: in expansion of macro ‘BOOST_HEADER_DEPRECATED’
7 | BOOST_HEADER_DEPRECATED("<boost/integer/integer_log2.hpp>");
| ^~~~~~~~~~~~~~~~~~~~~~~
In file included from /opt/boost1.69/include/boost/python/detail/is_xxx.hpp:8,
from /opt/boost1.69/include/boost/python/detail/is_auto_ptr.hpp:9,
from /opt/boost1.69/include/boost/python/detail/copy_ctor_mutates_rhs.hpp:8,
from /opt/boost1.69/include/boost/python/detail/value_arg.hpp:7,
from /opt/boost1.69/include/boost/python/object/forward.hpp:10,
from /opt/boost1.69/include/boost/python/object/pointer_holder.hpp:16,
from /opt/boost1.69/include/boost/python/to_python_indirect.hpp:10,
from /opt/boost1.69/include/boost/python/converter/arg_to_python.hpp:10,
from /opt/boost1.69/include/boost/python/call.hpp:15,
from /opt/boost1.69/include/boost/python/object_core.hpp:14,
from /opt/boost1.69/include/boost/python/args.hpp:22,
from /opt/boost1.69/include/boost/python.hpp:11,
from /build/src/moveit-1.0.7/moveit_ros/planning_interface/py_bindings_tools/include/moveit/py_bindings_tools/roscpp_initializer.h:40,
from /build/src/moveit-1.0.7/moveit_ros/planning_interface/planning_scene_interface/src/wrap_python_planning_scene_interface.cpp:38:
/opt/boost1.69/include/boost/python/detail/is_auto_ptr.hpp:17:40: warning: ‘template<class> class std::auto_ptr’ is deprecated [-Wdeprecated-declarations]
17 | BOOST_PYTHON_IS_XXX_DEF(auto_ptr, std::auto_ptr, 1)
| ^~~~~~~~
/opt/boost1.69/include/boost/detail/is_xxx.hpp:20:4: note: in definition of macro ‘BOOST_DETAIL_IS_XXX_DEF’
20 | qualified_name< BOOST_PP_ENUM_PARAMS_Z(1, nargs, T) > \
| ^~~~~~~~~~~~~~
/opt/boost1.69/include/boost/python/detail/is_auto_ptr.hpp:17:1: note: in expansion of macro ‘BOOST_PYTHON_IS_XXX_DEF’
17 | BOOST_PYTHON_IS_XXX_DEF(auto_ptr, std::auto_ptr, 1)
| ^~~~~~~~~~~~~~~~~~~~~~~
In file included from /usr/include/c++/10.2.0/memory:83,
from /opt/ros/melodic/include/moveit/macros/declare_ptr.h:38,
from /opt/ros/melodic/include/moveit/macros/class_forward.h:40,
from /build/src/moveit-1.0.7/moveit_ros/planning_interface/planning_scene_interface/include/moveit/planning_scene_interface/planning_scene_interface.h:40,
from /build/src/moveit-1.0.7/moveit_ros/planning_interface/planning_scene_interface/src/wrap_python_planning_scene_interface.cpp:37:
/usr/include/c++/10.2.0/bits/unique_ptr.h:57:28: note: declared here
57 | template<typename> class auto_ptr;
| ^~~~~~~~
In file included from /opt/boost1.69/include/boost/preprocessor/iteration/detail/iter/forward1.hpp:47,
from /opt/boost1.69/include/boost/python/call.hpp:33,
from /opt/boost1.69/include/boost/python/object_core.hpp:14,
from /opt/boost1.69/include/boost/python/args.hpp:22,
from /opt/boost1.69/include/boost/python.hpp:11,
from /build/src/moveit-1.0.7/moveit_ros/planning_interface/py_bindings_tools/include/moveit/py_bindings_tools/roscpp_initializer.h:40,
from /build/src/moveit-1.0.7/moveit_ros/planning_interface/planning_scene_interface/src/wrap_python_planning_scene_interface.cpp:38:
/opt/boost1.69/include/boost/python/call.hpp: In function ‘typename boost::python::detail::returnable<T>::type boost::python::call(PyObject*, boost::type<R>*)’:
/opt/boost1.69/include/boost/python/call.hpp:66:13: warning: ‘PyObject* PyEval_CallFunction(PyObject*, const char*, ...)’ is deprecated [-Wdeprecated-declarations]
66 | BOOST_PP_REPEAT_1ST(N, BOOST_PYTHON_FAST_ARG_TO_PYTHON_GET, nil)
| ^
In file included from /usr/include/python3.9/Python.h:145,
from /opt/boost1.69/include/boost/python/detail/wrap_python.hpp:151,
from /opt/boost1.69/include/boost/python/detail/prefix.hpp:13,
from /opt/boost1.69/include/boost/python/args.hpp:8,
from /opt/boost1.69/include/boost/python.hpp:11,
from /build/src/moveit-1.0.7/moveit_ros/planning_interface/py_bindings_tools/include/moveit/py_bindings_tools/roscpp_initializer.h:40,
from /build/src/moveit-1.0.7/moveit_ros/planning_interface/planning_scene_interface/src/wrap_python_planning_scene_interface.cpp:38:
/usr/include/python3.9/ceval.h:26:43: note: declared here
26 | Py_DEPRECATED(3.9) PyAPI_FUNC(PyObject *) PyEval_CallFunction(
| ^~~~~~~~~~~~~~~~~~~
In file included from /opt/boost1.69/include/boost/preprocessor/iteration/detail/iter/forward1.hpp:47,
from /opt/boost1.69/include/boost/python/call_method.hpp:32,
from /opt/boost1.69/include/boost/python.hpp:17,
from /build/src/moveit-1.0.7/moveit_ros/planning_interface/py_bindings_tools/include/moveit/py_bindings_tools/roscpp_initializer.h:40,
from /build/src/moveit-1.0.7/moveit_ros/planning_interface/planning_scene_interface/src/wrap_python_planning_scene_interface.cpp:38:
/opt/boost1.69/include/boost/python/call_method.hpp: In function ‘typename boost::python::detail::returnable<T>::type boost::python::call_method(PyObject*, const char*, boost::type<R>*)’:
/opt/boost1.69/include/boost/python/call_method.hpp:66:13: warning: ‘PyObject* PyEval_CallMethod(PyObject*, const char*, const char*, ...)’ is deprecated [-Wdeprecated-declarations]
66 | BOOST_PP_REPEAT_1ST(N, BOOST_PYTHON_FAST_ARG_TO_PYTHON_GET, nil)
| ^
In file included from /usr/include/python3.9/Python.h:145,
from /opt/boost1.69/include/boost/python/detail/wrap_python.hpp:151,
from /opt/boost1.69/include/boost/python/detail/prefix.hpp:13,
from /opt/boost1.69/include/boost/python/args.hpp:8,
from /opt/boost1.69/include/boost/python.hpp:11,
from /build/src/moveit-1.0.7/moveit_ros/planning_interface/py_bindings_tools/include/moveit/py_bindings_tools/roscpp_initializer.h:40,
from /build/src/moveit-1.0.7/moveit_ros/planning_interface/planning_scene_interface/src/wrap_python_planning_scene_interface.cpp:38:
/usr/include/python3.9/ceval.h:28:43: note: declared here
28 | Py_DEPRECATED(3.9) PyAPI_FUNC(PyObject *) PyEval_CallMethod(
| ^~~~~~~~~~~~~~~~~
In file included from /opt/boost1.69/include/boost/python/wrapper.hpp:8,
from /opt/boost1.69/include/boost/python/object/value_holder.hpp:15,
from /opt/boost1.69/include/boost/python/object/class_metadata.hpp:14,
from /opt/boost1.69/include/boost/python/class.hpp:23,
from /opt/boost1.69/include/boost/python.hpp:18,
from /build/src/moveit-1.0.7/moveit_ros/planning_interface/py_bindings_tools/include/moveit/py_bindings_tools/roscpp_initializer.h:40,
from /build/src/moveit-1.0.7/moveit_ros/planning_interface/planning_scene_interface/src/wrap_python_planning_scene_interface.cpp:38:
/opt/boost1.69/include/boost/python/override.hpp: In member function ‘boost::python::detail::method_result boost::python::override::operator()() const’:
/opt/boost1.69/include/boost/python/override.hpp:103:13: warning: ‘PyObject* PyEval_CallFunction(PyObject*, const char*, ...)’ is deprecated [-Wdeprecated-declarations]
103 | ));
| ^
In file included from /usr/include/python3.9/Python.h:145,
from /opt/boost1.69/include/boost/python/detail/wrap_python.hpp:151,
from /opt/boost1.69/include/boost/python/detail/prefix.hpp:13,
from /opt/boost1.69/include/boost/python/args.hpp:8,
from /opt/boost1.69/include/boost/python.hpp:11,
from /build/src/moveit-1.0.7/moveit_ros/planning_interface/py_bindings_tools/include/moveit/py_bindings_tools/roscpp_initializer.h:40,
from /build/src/moveit-1.0.7/moveit_ros/planning_interface/planning_scene_interface/src/wrap_python_planning_scene_interface.cpp:38:
/usr/include/python3.9/ceval.h:26:43: note: declared here
26 | Py_DEPRECATED(3.9) PyAPI_FUNC(PyObject *) PyEval_CallFunction(
| ^~~~~~~~~~~~~~~~~~~
In file included from /opt/boost1.69/include/boost/config/header_deprecated.hpp:18,
from /opt/boost1.69/include/boost/pending/integer_log2.hpp:5,
from /opt/boost1.69/include/boost/random/detail/integer_log2.hpp:19,
from /opt/boost1.69/include/boost/random/detail/large_arithmetic.hpp:19,
from /opt/boost1.69/include/boost/random/detail/const_mod.hpp:23,
from /opt/boost1.69/include/boost/random/detail/seed_impl.hpp:26,
from /opt/boost1.69/include/boost/random/mersenne_twister.hpp:30,
from /opt/ros/melodic/include/random_numbers/random_numbers.h:40,
from /opt/ros/melodic/include/moveit/robot_model/joint_model.h:46,
from /opt/ros/melodic/include/moveit/robot_model/joint_model_group.h:41,
from /opt/ros/melodic/include/moveit/robot_model/robot_model.h:47,
from /opt/ros/melodic/include/moveit/planning_scene/planning_scene.h:40,
from /opt/ros/melodic/include/moveit/planning_scene_monitor/planning_scene_monitor.h:44,
from /build/src/moveit-1.0.7/moveit_ros/planning_interface/moveit_cpp/include/moveit/moveit_cpp/moveit_cpp.h:42,
from /build/src/moveit-1.0.7/moveit_ros/planning_interface/moveit_cpp/src/moveit_cpp.cpp:38:
/opt/boost1.69/include/boost/config/pragma_message.hpp:24:34: note: ‘#pragma message: This header is deprecated. Use <boost/integer/integer_log2.hpp> instead.’
24 | # define BOOST_PRAGMA_MESSAGE(x) _Pragma(BOOST_STRINGIZE(message(x)))
| ^~~~~~~
/opt/boost1.69/include/boost/config/pragma_message.hpp:24:34: note: in definition of macro ‘BOOST_PRAGMA_MESSAGE’
24 | # define BOOST_PRAGMA_MESSAGE(x) _Pragma(BOOST_STRINGIZE(message(x)))
| ^~~~~~~
/opt/boost1.69/include/boost/pending/integer_log2.hpp:7:1: note: in expansion of macro ‘BOOST_HEADER_DEPRECATED’
7 | BOOST_HEADER_DEPRECATED("<boost/integer/integer_log2.hpp>");
| ^~~~~~~~~~~~~~~~~~~~~~~
In file included from /opt/boost1.69/include/boost/config/header_deprecated.hpp:18,
from /opt/boost1.69/include/boost/pending/integer_log2.hpp:5,
from /opt/boost1.69/include/boost/random/detail/integer_log2.hpp:19,
from /opt/boost1.69/include/boost/random/detail/large_arithmetic.hpp:19,
from /opt/boost1.69/include/boost/random/detail/const_mod.hpp:23,
from /opt/boost1.69/include/boost/random/detail/seed_impl.hpp:26,
from /opt/boost1.69/include/boost/random/mersenne_twister.hpp:30,
from /opt/ros/melodic/include/random_numbers/random_numbers.h:40,
from /opt/ros/melodic/include/moveit/robot_model/joint_model.h:46,
from /opt/ros/melodic/include/moveit/robot_model/joint_model_group.h:41,
from /opt/ros/melodic/include/moveit/robot_model/robot_model.h:47,
from /opt/ros/melodic/include/moveit/robot_state/robot_state.h:41,
from /opt/ros/melodic/include/moveit/kinematic_constraints/utils.h:44,
from /build/src/moveit-1.0.7/moveit_ros/planning_interface/moveit_cpp/src/planning_component.cpp:40:
/opt/boost1.69/include/boost/config/pragma_message.hpp:24:34: note: ‘#pragma message: This header is deprecated. Use <boost/integer/integer_log2.hpp> instead.’
24 | # define BOOST_PRAGMA_MESSAGE(x) _Pragma(BOOST_STRINGIZE(message(x)))
| ^~~~~~~
/opt/boost1.69/include/boost/config/pragma_message.hpp:24:34: note: in definition of macro ‘BOOST_PRAGMA_MESSAGE’
24 | # define BOOST_PRAGMA_MESSAGE(x) _Pragma(BOOST_STRINGIZE(message(x)))
| ^~~~~~~
/opt/boost1.69/include/boost/pending/integer_log2.hpp:7:1: note: in expansion of macro ‘BOOST_HEADER_DEPRECATED’
7 | BOOST_HEADER_DEPRECATED("<boost/integer/integer_log2.hpp>");
| ^~~~~~~~~~~~~~~~~~~~~~~
In file included from /opt/boost1.69/include/boost/config/header_deprecated.hpp:18,
from /opt/boost1.69/include/boost/pending/integer_log2.hpp:5,
from /opt/boost1.69/include/boost/random/detail/integer_log2.hpp:19,
from /opt/boost1.69/include/boost/random/detail/large_arithmetic.hpp:19,
from /opt/boost1.69/include/boost/random/detail/const_mod.hpp:23,
from /opt/boost1.69/include/boost/random/detail/seed_impl.hpp:26,
from /opt/boost1.69/include/boost/random/mersenne_twister.hpp:30,
from /opt/ros/melodic/include/random_numbers/random_numbers.h:40,
from /opt/ros/melodic/include/moveit/robot_model/joint_model.h:46,
from /opt/ros/melodic/include/moveit/robot_model/joint_model_group.h:41,
from /opt/ros/melodic/include/moveit/robot_model/robot_model.h:47,
from /opt/ros/melodic/include/moveit/robot_state/robot_state.h:41,
from /build/src/moveit-1.0.7/moveit_ros/planning_interface/move_group_interface/include/moveit/move_group_interface/move_group_interface.h:42,
from /build/src/moveit-1.0.7/moveit_ros/planning_interface/move_group_interface/src/demo.cpp:37:
/opt/boost1.69/include/boost/config/pragma_message.hpp:24:34: note: ‘#pragma message: This header is deprecated. Use <boost/integer/integer_log2.hpp> instead.’
24 | # define BOOST_PRAGMA_MESSAGE(x) _Pragma(BOOST_STRINGIZE(message(x)))
| ^~~~~~~
/opt/boost1.69/include/boost/config/pragma_message.hpp:24:34: note: in definition of macro ‘BOOST_PRAGMA_MESSAGE’
24 | # define BOOST_PRAGMA_MESSAGE(x) _Pragma(BOOST_STRINGIZE(message(x)))
| ^~~~~~~
/opt/boost1.69/include/boost/pending/integer_log2.hpp:7:1: note: in expansion of macro ‘BOOST_HEADER_DEPRECATED’
7 | BOOST_HEADER_DEPRECATED("<boost/integer/integer_log2.hpp>");
| ^~~~~~~~~~~~~~~~~~~~~~~
In file included from /opt/boost1.69/include/boost/config/header_deprecated.hpp:18,
from /opt/boost1.69/include/boost/pending/integer_log2.hpp:5,
from /opt/boost1.69/include/boost/random/detail/integer_log2.hpp:19,
from /opt/boost1.69/include/boost/random/detail/large_arithmetic.hpp:19,
from /opt/boost1.69/include/boost/random/detail/const_mod.hpp:23,
from /opt/boost1.69/include/boost/random/detail/seed_impl.hpp:26,
from /opt/boost1.69/include/boost/random/mersenne_twister.hpp:30,
from /opt/ros/melodic/include/random_numbers/random_numbers.h:40,
from /opt/ros/melodic/include/moveit/robot_model/joint_model.h:46,
from /opt/ros/melodic/include/moveit/robot_model/joint_model_group.h:41,
from /opt/ros/melodic/include/moveit/robot_model/robot_model.h:47,
from /opt/ros/melodic/include/moveit/robot_state/robot_state.h:41,
from /build/src/moveit-1.0.7/moveit_ros/planning_interface/move_group_interface/include/moveit/move_group_interface/move_group_interface.h:42,
from /build/src/moveit-1.0.7/moveit_ros/planning_interface/move_group_interface/src/wrap_python_move_group.cpp:37:
/opt/boost1.69/include/boost/config/pragma_message.hpp:24:34: note: ‘#pragma message: This header is deprecated. Use <boost/integer/integer_log2.hpp> instead.’
24 | # define BOOST_PRAGMA_MESSAGE(x) _Pragma(BOOST_STRINGIZE(message(x)))
| ^~~~~~~
/opt/boost1.69/include/boost/config/pragma_message.hpp:24:34: note: in definition of macro ‘BOOST_PRAGMA_MESSAGE’
24 | # define BOOST_PRAGMA_MESSAGE(x) _Pragma(BOOST_STRINGIZE(message(x)))
| ^~~~~~~
/opt/boost1.69/include/boost/pending/integer_log2.hpp:7:1: note: in expansion of macro ‘BOOST_HEADER_DEPRECATED’
7 | BOOST_HEADER_DEPRECATED("<boost/integer/integer_log2.hpp>");
| ^~~~~~~~~~~~~~~~~~~~~~~
In file included from /opt/boost1.69/include/boost/parameter/parameters.hpp:9,
from /opt/boost1.69/include/boost/parameter.hpp:11,
from /opt/boost1.69/include/boost/signals2/signal_type.hpp:32,
from /opt/boost1.69/include/boost/signals2.hpp:20,
from /opt/ros/melodic/include/tf2/buffer_core.h:37,
from /opt/ros/melodic/include/tf2_ros/buffer_interface.h:35,
from /opt/ros/melodic/include/tf2_ros/buffer.h:35,
from /build/src/moveit-1.0.7/moveit_ros/planning_interface/move_group_interface/include/moveit/move_group_interface/move_group_interface.h:56,
from /build/src/moveit-1.0.7/moveit_ros/planning_interface/move_group_interface/src/wrap_python_move_group.cpp:37:
/opt/boost1.69/include/boost/python/detail/is_auto_ptr.hpp:17:40: warning: ‘template<class> class std::auto_ptr’ is deprecated [-Wdeprecated-declarations]
17 | BOOST_PYTHON_IS_XXX_DEF(auto_ptr, std::auto_ptr, 1)
| ^~~~~~~~
/opt/boost1.69/include/boost/detail/is_xxx.hpp:20:4: note: in definition of macro ‘BOOST_DETAIL_IS_XXX_DEF’
20 | qualified_name< BOOST_PP_ENUM_PARAMS_Z(1, nargs, T) > \
| ^~~~~~~~~~~~~~
/opt/boost1.69/include/boost/python/detail/is_auto_ptr.hpp:17:1: note: in expansion of macro ‘BOOST_PYTHON_IS_XXX_DEF’
17 | BOOST_PYTHON_IS_XXX_DEF(auto_ptr, std::auto_ptr, 1)
| ^~~~~~~~~~~~~~~~~~~~~~~
In file included from /usr/include/c++/10.2.0/memory:83,
from /opt/ros/melodic/include/moveit/macros/declare_ptr.h:38,
from /opt/ros/melodic/include/moveit/macros/class_forward.h:40,
from /build/src/moveit-1.0.7/moveit_ros/planning_interface/move_group_interface/include/moveit/move_group_interface/move_group_interface.h:41,
from /build/src/moveit-1.0.7/moveit_ros/planning_interface/move_group_interface/src/wrap_python_move_group.cpp:37:
/usr/include/c++/10.2.0/bits/unique_ptr.h:57:28: note: declared here
57 | template<typename> class auto_ptr;
| ^~~~~~~~
In file included from /opt/boost1.69/include/boost/preprocessor/iteration/detail/iter/forward1.hpp:47,
from /opt/boost1.69/include/boost/python/call.hpp:33,
from /opt/boost1.69/include/boost/python/object_core.hpp:14,
from /opt/boost1.69/include/boost/python/args.hpp:22,
from /opt/boost1.69/include/boost/python.hpp:11,
from /build/src/moveit-1.0.7/moveit_ros/planning_interface/py_bindings_tools/include/moveit/py_bindings_tools/roscpp_initializer.h:40,
from /build/src/moveit-1.0.7/moveit_ros/planning_interface/move_group_interface/src/wrap_python_move_group.cpp:38:
/opt/boost1.69/include/boost/python/call.hpp: In function ‘typename boost::python::detail::returnable<T>::type boost::python::call(PyObject*, boost::type<R>*)’:
/opt/boost1.69/include/boost/python/call.hpp:66:13: warning: ‘PyObject* PyEval_CallFunction(PyObject*, const char*, ...)’ is deprecated [-Wdeprecated-declarations]
66 | BOOST_PP_REPEAT_1ST(N, BOOST_PYTHON_FAST_ARG_TO_PYTHON_GET, nil)
| ^
In file included from /usr/include/python3.9/Python.h:145,
from /opt/boost1.69/include/boost/python/detail/wrap_python.hpp:151,
from /opt/boost1.69/include/boost/python/detail/prefix.hpp:13,
from /opt/boost1.69/include/boost/python/args.hpp:8,
from /opt/boost1.69/include/boost/python.hpp:11,
from /build/src/moveit-1.0.7/moveit_ros/planning_interface/py_bindings_tools/include/moveit/py_bindings_tools/roscpp_initializer.h:40,
from /build/src/moveit-1.0.7/moveit_ros/planning_interface/move_group_interface/src/wrap_python_move_group.cpp:38:
/usr/include/python3.9/ceval.h:26:43: note: declared here
26 | Py_DEPRECATED(3.9) PyAPI_FUNC(PyObject *) PyEval_CallFunction(
| ^~~~~~~~~~~~~~~~~~~
In file included from /opt/boost1.69/include/boost/preprocessor/iteration/detail/iter/forward1.hpp:47,
from /opt/boost1.69/include/boost/python/call_method.hpp:32,
from /opt/boost1.69/include/boost/python.hpp:17,
from /build/src/moveit-1.0.7/moveit_ros/planning_interface/py_bindings_tools/include/moveit/py_bindings_tools/roscpp_initializer.h:40,
from /build/src/moveit-1.0.7/moveit_ros/planning_interface/move_group_interface/src/wrap_python_move_group.cpp:38:
/opt/boost1.69/include/boost/python/call_method.hpp: In function ‘typename boost::python::detail::returnable<T>::type boost::python::call_method(PyObject*, const char*, boost::type<R>*)’:
/opt/boost1.69/include/boost/python/call_method.hpp:66:13: warning: ‘PyObject* PyEval_CallMethod(PyObject*, const char*, const char*, ...)’ is deprecated [-Wdeprecated-declarations]
66 | BOOST_PP_REPEAT_1ST(N, BOOST_PYTHON_FAST_ARG_TO_PYTHON_GET, nil)
| ^
In file included from /usr/include/python3.9/Python.h:145,
from /opt/boost1.69/include/boost/python/detail/wrap_python.hpp:151,
from /opt/boost1.69/include/boost/python/detail/prefix.hpp:13,
from /opt/boost1.69/include/boost/python/args.hpp:8,
from /opt/boost1.69/include/boost/python.hpp:11,
from /build/src/moveit-1.0.7/moveit_ros/planning_interface/py_bindings_tools/include/moveit/py_bindings_tools/roscpp_initializer.h:40,
from /build/src/moveit-1.0.7/moveit_ros/planning_interface/move_group_interface/src/wrap_python_move_group.cpp:38:
/usr/include/python3.9/ceval.h:28:43: note: declared here
28 | Py_DEPRECATED(3.9) PyAPI_FUNC(PyObject *) PyEval_CallMethod(
| ^~~~~~~~~~~~~~~~~
In file included from /opt/boost1.69/include/boost/python/wrapper.hpp:8,
from /opt/boost1.69/include/boost/python/object/value_holder.hpp:15,
from /opt/boost1.69/include/boost/python/object/class_metadata.hpp:14,
from /opt/boost1.69/include/boost/python/class.hpp:23,
from /opt/boost1.69/include/boost/python.hpp:18,
from /build/src/moveit-1.0.7/moveit_ros/planning_interface/py_bindings_tools/include/moveit/py_bindings_tools/roscpp_initializer.h:40,
from /build/src/moveit-1.0.7/moveit_ros/planning_interface/move_group_interface/src/wrap_python_move_group.cpp:38:
/opt/boost1.69/include/boost/python/override.hpp: In member function ‘boost::python::detail::method_result boost::python::override::operator()() const’:
/opt/boost1.69/include/boost/python/override.hpp:103:13: warning: ‘PyObject* PyEval_CallFunction(PyObject*, const char*, ...)’ is deprecated [-Wdeprecated-declarations]
103 | ));
| ^
In file included from /usr/include/python3.9/Python.h:145,
from /opt/boost1.69/include/boost/python/detail/wrap_python.hpp:151,
from /opt/boost1.69/include/boost/python/detail/prefix.hpp:13,
from /opt/boost1.69/include/boost/python/args.hpp:8,
from /opt/boost1.69/include/boost/python.hpp:11,
from /build/src/moveit-1.0.7/moveit_ros/planning_interface/py_bindings_tools/include/moveit/py_bindings_tools/roscpp_initializer.h:40,
from /build/src/moveit-1.0.7/moveit_ros/planning_interface/move_group_interface/src/wrap_python_move_group.cpp:38:
/usr/include/python3.9/ceval.h:26:43: note: declared here
26 | Py_DEPRECATED(3.9) PyAPI_FUNC(PyObject *) PyEval_CallFunction(
| ^~~~~~~~~~~~~~~~~~~
/usr/bin/ld: /usr/lib/gcc/x86_64-pc-linux-gnu/10.2.0/../../../../lib/libfcl.so: undefined reference to `octomath::Pose6D::Pose6D(octomath::Pose6D const&)'
collect2: error: ld returned 1 exit status
make[2]: *** [move_group_interface/CMakeFiles/demo.dir/build.make:316: devel/lib/moveit_ros_planning_interface/demo] Error 1
make[1]: *** [CMakeFiles/Makefile2:3314: move_group_interface/CMakeFiles/demo.dir/all] Error 2
make[1]: *** Waiting for unfinished jobs....
make: *** [Makefile:149: all] Error 2
==> ERROR: A failure occurred in build().
Aborting...
No packages were built!
   
Git push to AUR Output
12b5784..b61191e