ros-melodic-moveit-ros-warehouse

Build Status: FAILURE     Last Build Date: 23.3.2021 00:32

Build Output
warning: dependency cycle detected:
warning: harfbuzz will be installed before its freetype2 dependency
warning: dependency cycle detected:
warning: libglvnd will be installed before its mesa dependency
% Total % Received % Xferd Average Speed Time Time Time Current
Dload Upload Total Spent Left Speed

0 0 0 0 0 0 0 0 --:--:-- --:--:-- --:--:-- 0
100 126 100 126 0 0 768 0 --:--:-- --:--:-- --:--:-- 768

100 1839k 100 1839k 0 0 4867k 0 --:--:-- --:--:-- --:--:-- 4867k
ros-melodic-moveit-ros-warehouse-1.0.7.tar.gz ... Passed
CMake Warning at /usr/src/gmock/CMakeLists.txt:43 (project):
VERSION keyword not followed by a value or was followed by a value that
expanded to nothing.


CMake Deprecation Warning at /usr/src/gmock/CMakeLists.txt:45 (cmake_minimum_required):
Compatibility with CMake < 2.8.12 will be removed from a future version of
CMake.

Update the VERSION argument <min> value or use a ...<max> suffix to tell
CMake that the project does not need compatibility with older versions.


CMake Warning at /usr/src/googletest/CMakeLists.txt:54 (project):
VERSION keyword not followed by a value or was followed by a value that
expanded to nothing.


CMake Deprecation Warning at /usr/src/googletest/CMakeLists.txt:56 (cmake_minimum_required):
Compatibility with CMake < 2.8.12 will be removed from a future version of
CMake.

Update the VERSION argument <min> value or use a ...<max> suffix to tell
CMake that the project does not need compatibility with older versions.


In file included from /opt/boost1.69/include/boost/config/header_deprecated.hpp:18,
from /opt/boost1.69/include/boost/pending/integer_log2.hpp:5,
from /opt/boost1.69/include/boost/random/detail/integer_log2.hpp:19,
from /opt/boost1.69/include/boost/random/detail/large_arithmetic.hpp:19,
from /opt/boost1.69/include/boost/random/detail/const_mod.hpp:23,
from /opt/boost1.69/include/boost/random/detail/seed_impl.hpp:26,
from /opt/boost1.69/include/boost/random/mersenne_twister.hpp:30,
from /opt/ros/melodic/include/random_numbers/random_numbers.h:40,
from /opt/ros/melodic/include/moveit/robot_model/joint_model.h:46,
from /opt/ros/melodic/include/moveit/robot_model/joint_model_group.h:41,
from /opt/ros/melodic/include/moveit/robot_model/robot_model.h:47,
from /opt/ros/melodic/include/moveit/planning_scene/planning_scene.h:40,
from /opt/ros/melodic/include/moveit/planning_scene_monitor/planning_scene_monitor.h:44,
from /build/src/moveit-1.0.7/moveit_ros/warehouse/warehouse/src/initialize_demo_db.cpp:40:
/opt/boost1.69/include/boost/config/pragma_message.hpp:24:34: note: ‘#pragma message: This header is deprecated. Use <boost/integer/integer_log2.hpp> instead.’
24 | # define BOOST_PRAGMA_MESSAGE(x) _Pragma(BOOST_STRINGIZE(message(x)))
| ^~~~~~~
/opt/boost1.69/include/boost/config/pragma_message.hpp:24:34: note: in definition of macro ‘BOOST_PRAGMA_MESSAGE’
24 | # define BOOST_PRAGMA_MESSAGE(x) _Pragma(BOOST_STRINGIZE(message(x)))
| ^~~~~~~
/opt/boost1.69/include/boost/pending/integer_log2.hpp:7:1: note: in expansion of macro ‘BOOST_HEADER_DEPRECATED’
7 | BOOST_HEADER_DEPRECATED("<boost/integer/integer_log2.hpp>");
| ^~~~~~~~~~~~~~~~~~~~~~~
In file included from /opt/boost1.69/include/boost/config/header_deprecated.hpp:18,
from /opt/boost1.69/include/boost/pending/integer_log2.hpp:5,
from /opt/boost1.69/include/boost/random/detail/integer_log2.hpp:19,
from /opt/boost1.69/include/boost/random/detail/large_arithmetic.hpp:19,
from /opt/boost1.69/include/boost/random/detail/const_mod.hpp:23,
from /opt/boost1.69/include/boost/random/detail/seed_impl.hpp:26,
from /opt/boost1.69/include/boost/random/mersenne_twister.hpp:30,
from /opt/ros/melodic/include/random_numbers/random_numbers.h:40,
from /opt/ros/melodic/include/moveit/robot_model/joint_model.h:46,
from /opt/ros/melodic/include/moveit/robot_model/joint_model_group.h:41,
from /opt/ros/melodic/include/moveit/robot_model/robot_model.h:47,
from /opt/ros/melodic/include/moveit/planning_scene/planning_scene.h:40,
from /opt/ros/melodic/include/moveit/planning_scene_monitor/planning_scene_monitor.h:44,
from /build/src/moveit-1.0.7/moveit_ros/warehouse/warehouse/src/import_from_text.cpp:40:
/opt/boost1.69/include/boost/config/pragma_message.hpp:24:34: note: ‘#pragma message: This header is deprecated. Use <boost/integer/integer_log2.hpp> instead.’
24 | # define BOOST_PRAGMA_MESSAGE(x) _Pragma(BOOST_STRINGIZE(message(x)))
| ^~~~~~~
/opt/boost1.69/include/boost/config/pragma_message.hpp:24:34: note: in definition of macro ‘BOOST_PRAGMA_MESSAGE’
24 | # define BOOST_PRAGMA_MESSAGE(x) _Pragma(BOOST_STRINGIZE(message(x)))
| ^~~~~~~
/opt/boost1.69/include/boost/pending/integer_log2.hpp:7:1: note: in expansion of macro ‘BOOST_HEADER_DEPRECATED’
7 | BOOST_HEADER_DEPRECATED("<boost/integer/integer_log2.hpp>");
| ^~~~~~~~~~~~~~~~~~~~~~~
/usr/bin/ld: /usr/lib/gcc/x86_64-pc-linux-gnu/10.2.0/../../../../lib/libfcl.so: undefined reference to `octomath::Pose6D::Pose6D(octomath::Pose6D const&)'
collect2: error: ld returned 1 exit status
make[2]: *** [warehouse/CMakeFiles/moveit_init_demo_warehouse.dir/build.make:308: devel/lib/moveit_ros_warehouse/moveit_init_demo_warehouse] Error 1
make[1]: *** [CMakeFiles/Makefile2:2767: warehouse/CMakeFiles/moveit_init_demo_warehouse.dir/all] Error 2
make[1]: *** Waiting for unfinished jobs....
/usr/bin/ld: /usr/lib/gcc/x86_64-pc-linux-gnu/10.2.0/../../../../lib/libfcl.so: undefined reference to `octomath::Pose6D::Pose6D(octomath::Pose6D const&)'
collect2: error: ld returned 1 exit status
make[2]: *** [warehouse/CMakeFiles/moveit_warehouse_import_from_text.dir/build.make:308: devel/lib/moveit_ros_warehouse/moveit_warehouse_import_from_text] Error 1
make[1]: *** [CMakeFiles/Makefile2:2794: warehouse/CMakeFiles/moveit_warehouse_import_from_text.dir/all] Error 2
make: *** [Makefile:149: all] Error 2
==> ERROR: A failure occurred in build().
Aborting...
No packages were built!
   
Git push to AUR Output
b4fb668..cae8d3a