Package Name ros-melodic-roslib
Status FAILURE
Last Build Date 20.1.2022 01:30
Repo URL git://github.com/ros-melodic-arch/ros-melodic-roslib.git

Build Output
:: Synchronizing package databases...
core downloading...
extra downloading...
community downloading...
multilib downloading...
abs_cd-local downloading...
==> Making package: ros-melodic-roslib 1.14.9-4 (Thu 20 Jan 2022 01:29:28 AM UTC)
==> Checking runtime dependencies...
==> Installing missing dependencies...
resolving dependencies...
looking for conflicting packages...

Packages (26) boost1.69-1.69.0-10 boost1.69-libs-1.69.0-10 gtest-1.11.0-3 libyaml-0.2.5-1 python-appdirs-1.4.4-6 python-argparse-1.4.0-11 python-catkin_pkg-0.4.24-1 python-dateutil-2.8.2-4 python-distro-1.6.0-4 python-docutils-1:0.16-2 python-empy-3.3.4-7 python-more-itertools-8.10.0-4 python-nose-1.3.7-13 python-ordered-set-4.0.2-6 python-packaging-20.9-7 python-pyparsing-2.4.7-6 python-rosdep-0.21.0-1 python-rosdistro-0.8.3-1 python-setuptools-1:59.1.1-1 python-yaml-5.4.1.1-4 ros-build-tools-py3-0.3.1-2 tinyxml2-9.0.0-1 python-rospkg-1.3.0-1 ros-melodic-catkin-1:0.7.29-3 ros-melodic-ros-environment-1.2.3-2 ros-melodic-rospack-2.5.6-4

Total Installed Size: 192.08 MiB

:: Proceed with installation? [Y/n]
checking keyring...
checking package integrity...
loading package files...
checking for file conflicts...
checking available disk space...
:: Processing package changes...
installing ros-melodic-ros-environment...
installing tinyxml2...
installing python-argparse...
installing python-dateutil...
installing python-docutils...
installing python-pyparsing...
installing python-catkin_pkg...
installing python-appdirs...
installing python-more-itertools...
installing python-ordered-set...
installing python-packaging...
installing python-setuptools...
installing python-distro...
installing libyaml...
installing python-yaml...
installing python-rospkg...
installing python-rosdistro...
installing python-rosdep...
installing boost1.69-libs...
Optional dependencies for boost1.69-libs
openmpi: for mpi support
installing boost1.69...
Optional dependencies for boost1.69
python: for python bindings [installed]
installing ros-melodic-rospack...
installing python-nose...
installing gtest...
Optional dependencies for gtest
python: gmock generator [installed]
installing python-empy...
installing ros-build-tools-py3...
Optional dependencies for ros-build-tools-py3
python3 [installed]
python-argparse [installed]
python-yaml [installed]
python-termcolor
python-certifi
installing ros-melodic-catkin...
:: Running post-transaction hooks...
(1/1) Arming ConditionNeedsUpdate...
==> Checking buildtime dependencies...
==> Installing missing dependencies...
resolving dependencies...
looking for conflicting packages...

Packages (5) hicolor-icon-theme-0.17-2 jsoncpp-1.9.5-1 libuv-1.43.0-1 rhash-1.4.2-1 cmake-3.22.1-5

Total Installed Size: 63.86 MiB

:: Proceed with installation? [Y/n]
checking keyring...
checking package integrity...
loading package files...
checking for file conflicts...
checking available disk space...
:: Processing package changes...
installing hicolor-icon-theme...
installing jsoncpp...
Optional dependencies for jsoncpp
jsoncpp-doc: documentation
installing libuv...
installing rhash...
installing cmake...
Optional dependencies for cmake
qt6-base: cmake-gui
:: Running post-transaction hooks...
(1/1) Arming ConditionNeedsUpdate...
==> Retrieving sources...
-> Downloading ros-melodic-roslib-1.14.9.tar.gz...
% Total % Received % Xferd Average Speed Time Time Time Current
Dload Upload Total Spent Left Speed

0 0 0 0 0 0 0 0 --:--:-- --:--:-- --:--:-- 0
0 0 0 0 0 0 0 0 --:--:-- --:--:-- --:--:-- 0
100 115 100 115 0 0 654 0 --:--:-- --:--:-- --:--:-- 653

100 171k 0 171k 0 0 451k 0 --:--:-- --:--:-- --:--:-- 451k
-> Downloading 256.patch...
% Total % Received % Xferd Average Speed Time Time Time Current
Dload Upload Total Spent Left Speed

0 0 0 0 0 0 0 0 --:--:-- --:--:-- --:--:-- 0
100 965 0 965 0 0 3753 0 --:--:-- --:--:-- --:--:-- 3769
==> Validating source files with sha256sums...
ros-melodic-roslib-1.14.9.tar.gz ... Passed
256.patch ... Passed
==> Extracting sources...
-> Extracting ros-melodic-roslib-1.14.9.tar.gz with bsdtar
==> Starting prepare()...
patching file core/roslib/src/roslib/network.py
==> Starting build()...
-- The C compiler identification is GNU 11.1.0
-- The CXX compiler identification is GNU 11.1.0
-- Detecting C compiler ABI info
-- Detecting C compiler ABI info - done
-- Check for working C compiler: /usr/bin/cc - skipped
-- Detecting C compile features
-- Detecting C compile features - done
-- Detecting CXX compiler ABI info
-- Detecting CXX compiler ABI info - done
-- Check for working CXX compiler: /usr/bin/c++ - skipped
-- Detecting CXX compile features
-- Detecting CXX compile features - done
-- Using CATKIN_DEVEL_PREFIX: /build/src/build/devel
-- Using CMAKE_PREFIX_PATH: /opt/ros/melodic
-- This workspace overlays: /opt/ros/melodic
-- Found PythonInterp: /usr/bin/python3 (found suitable version "3.10.1", minimum required is "2")
-- Using PYTHON_EXECUTABLE: /usr/bin/python3
-- Using default Python package layout
-- Found PY_em: /usr/lib/python3.10/site-packages/em.py
-- Using empy: /usr/lib/python3.10/site-packages/em.py
-- Using CATKIN_ENABLE_TESTING: ON
-- Skip enable_testing() when building binary package
-- Using CATKIN_TEST_RESULTS_DIR: /build/src/build/test_results
-- Forcing gtest/gmock from source, though one was otherwise available.
-- Found gtest sources under '/usr/src/gmock': gtests will be built
-- Found gmock sources under '/usr/src/gmock': gmock will be built
-- Found Python: /usr/bin/python3.10 (found version "3.10.1") found components: Interpreter
-- Found Threads: TRUE
-- Using Python nosetests: /usr/bin/nosetests-3.10
-- catkin 0.7.29
-- BUILD_SHARED_LIBS is on
-- Found Boost: /opt/boost1.69/include (found version "1.69.0") found components: thread chrono date_time atomic
/opt/ros/melodic/share/catkin/cmake/interrogate_setup_dot_py.py:43: DeprecationWarning: The distutils package is deprecated and slated for removal in Python 3.12. Use setuptools or check PEP 632 for potential alternatives
import distutils.core
-- Found Boost: /opt/boost1.69/include (found version "1.69.0") found components: filesystem thread chrono date_time atomic
-- Configuring done
-- Generating done
-- Build files have been written to: /build/src/build
[ 50%] Building CXX object CMakeFiles/roslib.dir/src/package.cpp.o
[100%] Linking CXX shared library devel/lib/libroslib.so
[100%] Built target roslib
==> Entering fakeroot environment...
==> Starting package()...
Consolidate compiler generated dependencies of target roslib
[100%] Built target roslib
Install the project...
-- Install configuration: "Release"
-- Installing: /build/pkg/ros-melodic-roslib/opt/ros/melodic/lib/pkgconfig/roslib.pc
-- Installing: /build/pkg/ros-melodic-roslib/opt/ros/melodic/share/roslib/cmake/roslib-extras.cmake
-- Installing: /build/pkg/ros-melodic-roslib/opt/ros/melodic/share/roslib/cmake/roslibConfig.cmake
-- Installing: /build/pkg/ros-melodic-roslib/opt/ros/melodic/share/roslib/cmake/roslibConfig-version.cmake
-- Installing: /build/pkg/ros-melodic-roslib/opt/ros/melodic/share/roslib/package.xml
+ cd /build/src/ros-1.14.9/core/roslib
+ mkdir -p /build/pkg/ros-melodic-roslib//opt/ros/melodic/lib/python3.10/site-packages
+ /usr/bin/env PYTHONPATH=/opt/ros/melodic/lib/python3.10/site-packages:/build/src/build/lib/python3.10/site-packages:/opt/ros/melodic/lib/python3.10/site-packages CATKIN_BINARY_DIR=/build/src/build /usr/bin/python3 /build/src/ros-1.14.9/core/roslib/setup.py egg_info --egg-base /build/src/build build --build-base /build/src/build install --root=/build/pkg/ros-melodic-roslib/ --prefix=/opt/ros/melodic --install-scripts=/opt/ros/melodic/bin
running egg_info
creating /build/src/build/roslib.egg-info
writing /build/src/build/roslib.egg-info/PKG-INFO
Traceback (most recent call last):
File "/build/src/ros-1.14.9/core/roslib/setup.py", line 10, in <module>
setup(**d)
File "/usr/lib/python3.10/site-packages/setuptools/__init__.py", line 153, in setup
return distutils.core.setup(**attrs)
File "/usr/lib/python3.10/distutils/core.py", line 148, in setup
dist.run_commands()
File "/usr/lib/python3.10/distutils/dist.py", line 966, in run_commands
self.run_command(cmd)
File "/usr/lib/python3.10/distutils/dist.py", line 985, in run_command
cmd_obj.run()
File "/usr/lib/python3.10/site-packages/setuptools/command/egg_info.py", line 292, in run
writer(self, ep.name, os.path.join(self.egg_info, ep.name))
File "/usr/lib/python3.10/site-packages/setuptools/command/egg_info.py", line 656, in write_pkg_info
metadata.write_pkg_info(cmd.egg_info)
File "/usr/lib/python3.10/distutils/dist.py", line 1117, in write_pkg_info
self.write_pkg_file(pkg_info)
File "/usr/lib/python3.10/site-packages/setuptools/dist.py", line 167, in write_pkg_file
write_field('Summary', single_line(self.get_description()))
File "/usr/lib/python3.10/site-packages/setuptools/dist.py", line 151, in single_line
raise ValueError('Newlines are not allowed')
ValueError: Newlines are not allowed
CMake Error at catkin_generated/safe_execute_install.cmake:4 (message):

execute_process(/build/src/build/catkin_generated/python_distutils_install.sh)
returned error code
Call Stack (most recent call first):
cmake_install.cmake:65 (include)


make: *** [Makefile:100: install] Error 1
==> ERROR: A failure occurred in package().
Aborting...
No packages were built!

Git push to AUR Output
[up to date]