Package Name ros-melodic-tf
Status FAILURE
Last Build Date 20.1.2022 01:45
Repo URL git://github.com/ros-melodic-arch/ros-melodic-tf.git

Build Output
:: Synchronizing package databases...
core downloading...
extra downloading...
community downloading...
multilib downloading...
abs_cd-local downloading...
==> Making package: ros-melodic-tf 1.12.1-3 (Thu 20 Jan 2022 01:43:59 AM UTC)
==> Checking runtime dependencies...
==> Installing missing dependencies...
resolving dependencies...
looking for conflicting packages...
warning: dependency cycle detected:
warning: harfbuzz will be installed before its freetype2 dependency
warning: dependency cycle detected:
warning: libglvnd will be installed before its mesa dependency

Packages (227) adobe-source-code-pro-fonts-2.038ro+1.058it+1.018var-1 adwaita-icon-theme-41.0-1 alsa-lib-1.2.6.1-1 alsa-topology-conf-1.2.5.1-1 alsa-ucm-conf-1.2.6.3-1 aom-3.2.0-1 at-spi2-atk-2.38.0-1 at-spi2-core-2.42.0-1 atk-2.36.0-1 avahi-0.8+22+gfd482a7-3 blas-3.10.0-1 boost1.69-libs-1.69.0-10 cairo-1.17.4-5 cantarell-fonts-1:0.303.1-1 cblas-3.10.0-1 console-bridge-1.0.1-2 dav1d-0.9.2-1 dconf-0.40.0-1 desktop-file-utils-0.26-1 flac-1.3.3-3 fontconfig-2:2.13.94-2 freetype2-2.11.1-1 fribidi-1.0.11-1 gd-2.3.3-3 gdk-pixbuf2-2.42.6-2 ghostscript-9.55.0-3 giflib-5.2.1-2 glib-networking-1:2.70.1-1 graphite-1:1.3.14-1 gsettings-desktop-schemas-41.0-1 gsfonts-20200910-2 gst-plugins-base-libs-1.18.5-1 gstreamer-1.18.5-1 gtest-1.11.0-3 gtk-update-icon-cache-1:4.6.0-2 gtk3-1:3.24.31-1 gts-0.7.6.121130-2 harfbuzz-3.2.0-1 hicolor-icon-theme-0.17-2 ijs-0.35-3 iso-codes-4.9.0-1 jbig2dec-0.19-1 json-glib-1.6.6-1 lapack-3.10.0-1 lcms2-2.12-1 libaio-0.3.112-2 libasyncns-0.8+3+g68cd5af-3 libavif-0.9.3-1 libcanberra-0.30+2+gc0620e4-5 libcloudproviders-0.3.1-2 libcolord-1.4.5-4 libcups-1:2.4.0-4 libdaemon-0.14-5 libdatrie-0.2.13-1 libde265-1.0.8-1 libdrm-2.4.109-1 libepoxy-1.5.9-1 libglvnd-1.4.0-1 libgudev-237-1 libheif-1.12.0-2 libice-1.0.10-3 libidn-1.38-1 libjpeg-turbo-2.1.2-1 libnotify-0.7.9-2 libogg-1.3.5-1 libomxil-bellagio-0.9.3-3 libpaper-1.1.28-1 libpciaccess-0.16-2 libpng-1.6.37-3 libproxy-0.4.17-6 libpulse-15.0-1 librsvg-2:2.52.5-1 libsm-1.2.3-2 libsndfile-1.0.31-1 libsodium-1.0.18-2 libsoup-2.74.2-2 libsoup3-3.0.4-2 libstemmer-2.2.0-1 libthai-0.1.29-1 libtiff-4.3.0-1 libunwind-1.6.2-1 libusb-1.0.24-2 libvorbis-1.3.7-2 libwebp-1.2.1-2 libx11-1.7.3.1-1 libxau-1.0.9-3 libxaw-1.0.14-1 libxcb-1.14-1 libxcomposite-0.4.5-3 libxcursor-1.2.0-2 libxdamage-1.1.5-3 libxdmcp-1.1.3-3 libxext-1.3.4-3 libxfixes-6.0.0-1 libxft-2.3.4-1 libxi-1.8-1 libxinerama-1.1.4-3 libxkbcommon-1.3.1-1 libxmu-1.1.3-2 libxpm-3.5.13-2 libxrandr-1.5.2-3 libxrender-0.9.10-4 libxshmfence-1.3-2 libxt-1.2.1-1 libxtst-1.2.3-4 libxv-1.0.11-4 libxxf86vm-1.1.4-4 libyaml-0.2.5-1 libyuv-r2266+eb6e7bb6-1 llvm-libs-13.0.0-6 lm_sensors-1:3.6.0.r41.g31d1f125-1 log4cxx-0.12.0-1 lzo-2.10-3 mariadb-libs-10.6.5-2 mesa-21.3.4-1 netpbm-10.73.37-1 openjpeg2-2.4.0-1 opus-1.3.1-2 orc-0.4.32-1 pango-1:1.50.3-1 pixman-0.40.0-1 poco-1.11.1-1 python-appdirs-1.4.4-6 python-argparse-1.4.0-11 python-bcrypt-3.2.0-5 python-catkin_pkg-0.4.24-1 python-cffi-1.15.0-3 python-cryptography-36.0.1-1 python-dateutil-2.8.2-4 python-defusedxml-0.7.1-4 python-distro-1.6.0-4 python-docutils-1:0.16-2 python-empy-3.3.4-7 python-gnupg-0.4.8-2 python-more-itertools-8.10.0-4 python-netifaces-0.11.0-3 python-nose-1.3.7-13 python-numpy-1.21.5-2 python-ordered-set-4.0.2-6 python-packaging-20.9-7 python-paramiko-2.9.2-1 python-ply-3.11-10 python-pycparser-2.21-3 python-pycryptodome-3.12.0-1 python-pynacl-1.4.0-5 python-pyparsing-2.4.7-6 python-rosdep-0.21.0-1 python-rosdistro-0.8.3-1 python-rospkg-1.3.0-1 python-setuptools-1:59.1.1-1 python-wxpython-1:4.0.7.2-3 python-yaml-5.4.1.1-4 rav1e-0.4.1-1 rest-0.8.1+r4+ge5ee6ef-1 ros-build-tools-py3-0.3.1-2 ros-melodic-actionlib-1.12.1-5 ros-melodic-actionlib-msgs-1.12.8-2 ros-melodic-catkin-1:0.7.29-3 ros-melodic-class-loader-0.4.1-5 ros-melodic-cpp-common-0.6.14-4 ros-melodic-gencpp-0.6.5-3 ros-melodic-geneus-2.2.6-2 ros-melodic-genlisp-0.4.16-1 ros-melodic-genmsg-0.5.16-2 ros-melodic-gennodejs-2.0.1-2 ros-melodic-genpy-0.6.16-1 ros-melodic-message-generation-0.4.1-3 ros-melodic-pluginlib-1.12.1-5 ros-melodic-ros-environment-1.2.3-2 ros-melodic-rosbag-1.14.11-1 ros-melodic-rosbag-storage-1.14.11-1 ros-melodic-rosbuild-1.14.9-2 ros-melodic-rosclean-1.14.9-2 ros-melodic-roscpp-serialization-0.6.14-2 ros-melodic-roscpp-traits-0.6.14-2 ros-melodic-rosgraph-1.14.11-1 ros-melodic-rosgraph-msgs-1.11.2-3 ros-melodic-roslaunch-1.14.11-2 ros-melodic-roslib-1.14.9-4 ros-melodic-roslz4-1.14.11-1 ros-melodic-rosmaster-1.14.11-1 ros-melodic-rosmsg-1.14.11-1 ros-melodic-rosnode-1.14.11-1 ros-melodic-rosout-1.14.11-3 ros-melodic-rospack-2.5.6-4 ros-melodic-rosparam-1.14.11-1 ros-melodic-rospy-1.14.11-2 ros-melodic-rosservice-1.14.11-1 ros-melodic-rostest-1.14.11-1 ros-melodic-rostime-0.6.14-4 ros-melodic-rostopic-1.14.11-1 ros-melodic-rosunit-1.14.9-1 ros-melodic-std-srvs-1.11.2-2 ros-melodic-tf2-0.6.6-4 ros-melodic-tf2-msgs-0.6.6-2 ros-melodic-tf2-py-0.6.6-3 ros-melodic-topic-tools-1.14.11-1 ros-melodic-xmlrpcpp-1.14.11-1 run-parts-5.5-1 shared-mime-info-2.0+115+gd74a913-1 sound-theme-freedesktop-0.8-4 speex-1.2.0-3 speexdsp-1.2.0-2 svt-av1-0.8.7-1 tdb-1.4.5-3 tinyxml2-9.0.0-1 tracker3-3.2.1-2 unixodbc-2.3.9-1 vulkan-icd-loader-1.2.202-1 wayland-1.20.0-1 wxgtk-common-3.0.5.1-3 wxgtk3-3.0.5.1-3 x265-3.5-1 xcb-proto-1.14.1-5 xkeyboard-config-2.34-1 xorgproto-2021.5-1 boost1.69-1.69.0-10 graphviz-2.50.0-2 ros-melodic-geometry-msgs-1.12.8-1 ros-melodic-message-filters-1.14.11-1 ros-melodic-message-runtime-0.4.12-3 ros-melodic-rosconsole-1.13.18-5 ros-melodic-roscpp-1.14.11-1 ros-melodic-roswtf-1.14.11-1 ros-melodic-sensor-msgs-1.12.8-1 ros-melodic-std-msgs-0.5.13-1 ros-melodic-tf2-ros-0.6.6-3

Total Installed Size: 947.32 MiB

:: Proceed with installation? [Y/n]
checking keyring...
checking package integrity...
loading package files...
checking for file conflicts...
checking available disk space...
:: Processing package changes...
installing boost1.69-libs...
Optional dependencies for boost1.69-libs
openmpi: for mpi support
installing boost1.69...
Optional dependencies for boost1.69
python: for python bindings [installed]
installing console-bridge...
installing ros-melodic-cpp-common...
installing ros-melodic-rostime...
installing ros-melodic-roscpp-traits...
installing python-appdirs...
installing python-more-itertools...
installing python-ordered-set...
installing python-pyparsing...
installing python-packaging...
installing python-setuptools...
installing python-nose...
installing gtest...
Optional dependencies for gtest
python: gmock generator [installed]
installing python-argparse...
installing python-dateutil...
installing python-docutils...
installing python-catkin_pkg...
installing python-empy...
installing ros-build-tools-py3...
Optional dependencies for ros-build-tools-py3
python3 [installed]
python-argparse [installed]
python-yaml [pending]
python-termcolor
python-certifi
installing ros-melodic-catkin...
installing ros-melodic-genmsg...
installing libyaml...
installing python-yaml...
installing ros-melodic-genpy...
installing ros-melodic-roscpp-serialization...
installing ros-melodic-message-runtime...
installing ros-melodic-geneus...
installing ros-melodic-gencpp...
installing ros-melodic-gennodejs...
installing ros-melodic-genlisp...
installing ros-melodic-message-generation...
installing ros-melodic-rosbuild...
installing ros-melodic-std-msgs...
installing ros-melodic-rosgraph-msgs...
installing ros-melodic-xmlrpcpp...
installing log4cxx...
installing ros-melodic-rosconsole...
installing ros-melodic-roscpp...
installing python-netifaces...
installing python-distro...
installing python-rospkg...
installing ros-melodic-rosgraph...
installing ros-melodic-ros-environment...
installing tinyxml2...
installing python-rosdistro...
installing python-rosdep...
installing ros-melodic-rospack...
installing ros-melodic-roslib...
installing blas...
installing cblas...
installing lapack...
installing python-numpy...
Optional dependencies for python-numpy
openblas: faster linear algebra
installing ros-melodic-rospy...
installing ros-melodic-std-srvs...
installing ros-melodic-roslz4...
installing libaio...
installing lzo...
installing mariadb-libs...
Optional dependencies for mariadb-libs
krb5: for gssapi authentication [installed]
installing unixodbc...
installing poco...
installing ros-melodic-class-loader...
installing ros-melodic-pluginlib...
installing ros-melodic-rosbag-storage...
installing ros-melodic-topic-tools...
installing python-gnupg...
installing python-pycryptodome...
installing ros-melodic-rosbag...
installing ros-melodic-rostopic...
installing ros-melodic-rosnode...
installing ros-melodic-rosout...
installing ros-melodic-rosparam...
installing ros-melodic-rosclean...
installing ros-melodic-rosunit...
installing python-defusedxml...
installing ros-melodic-rosmaster...
installing python-ply...
installing python-pycparser...
installing python-cffi...
installing python-bcrypt...
installing python-cryptography...
installing libsodium...
installing python-pynacl...
installing python-paramiko...
installing ros-melodic-roslaunch...
installing ros-melodic-rosmsg...
installing ros-melodic-rosservice...
installing ros-melodic-roswtf...
installing ros-melodic-actionlib-msgs...
installing ros-melodic-geometry-msgs...
installing ros-melodic-tf2-msgs...
installing ros-melodic-tf2...
installing ros-melodic-tf2-py...
installing ros-melodic-rostest...
installing atk...
installing libpng...
installing graphite...
installing harfbuzz...
Optional dependencies for harfbuzz
cairo: hb-view program [pending]
chafa: hb-view program
installing freetype2...
installing fontconfig...
Creating fontconfig configuration...
Rebuilding fontconfig cache...
installing xcb-proto...
installing libxdmcp...
installing libxau...
installing libxcb...
installing xorgproto...
installing libx11...
installing libxext...
installing libxrender...
installing pixman...
installing cairo...
installing libxfixes...
installing libxcursor...
Optional dependencies for libxcursor
gnome-themes-standard: fallback icon theme
installing libxinerama...
installing libxrandr...
installing libxi...
installing libepoxy...
installing libjpeg-turbo...
Optional dependencies for libjpeg-turbo
java-runtime>11: for TurboJPEG Java wrapper
installing libtiff...
Optional dependencies for libtiff
freeglut: for using tiffgt
installing shared-mime-info...
installing gdk-pixbuf2...
Optional dependencies for gdk-pixbuf2
libwmf: Load .wmf and .apm
libopenraw: Load .dng, .cr2, .crw, .nef, .orf, .pef, .arw, .erf, .mrw, and .raf
libavif: Load .avif [pending]
libheif: Load .heif, .heic, and .avif [pending]
librsvg: Load .svg, .svgz, and .svg.gz [pending]
webp-pixbuf-loader: Load .webp
installing dconf...
installing libxcomposite...
installing libxdamage...
installing libdatrie...
installing libthai...
installing libxft...
installing fribidi...
installing pango...
installing libxtst...
installing at-spi2-core...
Optional dependencies for at-spi2-core
dbus-broker: Alternative bus implementation
installing at-spi2-atk...
installing wayland...
installing xkeyboard-config...
installing libxkbcommon...
Optional dependencies for libxkbcommon
libxkbcommon-x11: xkbcli interactive-x11
wayland: xkbcli interactive-wayland [installed]
installing hicolor-icon-theme...
installing librsvg...
installing gtk-update-icon-cache...
installing adwaita-icon-theme...
installing json-glib...
installing desktop-file-utils...
installing libpciaccess...
installing libdrm...
installing libxxf86vm...
installing libxshmfence...
installing libomxil-bellagio...
installing libunwind...
installing llvm-libs...
installing lm_sensors...
Optional dependencies for lm_sensors
rrdtool: for logging with sensord
perl: for sensor detection and configuration convert [installed]
installing libglvnd...
installing vulkan-icd-loader...
Optional dependencies for vulkan-icd-loader
vulkan-driver: packaged vulkan driver
installing mesa...
Optional dependencies for mesa
opengl-man-pages: for the OpenGL API man pages
mesa-vdpau: for accelerated video playback
libva-mesa-driver: for accelerated video playback
installing cantarell-fonts...
installing lcms2...
installing libcolord...
installing libproxy...
Optional dependencies for libproxy
networkmanager: NetworkManager configuration module
perl: Perl bindings [installed]
python: Python 3.x bindings [installed]
libproxy-webkit: PAC proxy support (via WebKit)
installing adobe-source-code-pro-fonts...
installing gsettings-desktop-schemas...
installing glib-networking...
installing libsoup...
Optional dependencies for libsoup
samba: Windows Domain SSO
installing rest...
installing libdaemon...
installing avahi...
Optional dependencies for avahi
gtk3: avahi-discover, avahi-discover-standalone, bshell, bssh, bvnc [pending]
qt5-base: qt5 bindings
libevent: libevent bindings
nss-mdns: NSS support for mDNS
python-twisted: avahi-bookmarks
python-gobject: avahi-bookmarks, avahi-discover
python-dbus: avahi-bookmarks, avahi-discover
installing libusb...
installing libcups...
installing libogg...
installing libvorbis...
installing alsa-topology-conf...
installing alsa-ucm-conf...
installing alsa-lib...
installing libasyncns...
installing libice...
installing libsm...
installing opus...
installing speexdsp...
installing speex...
installing flac...
installing libsndfile...
Optional dependencies for libsndfile
alsa-lib: for sndfile-play [installed]
installing libpulse...
Optional dependencies for libpulse
glib2: mainloop integration [installed]
installing tdb...
Optional dependencies for tdb
python: for python bindings [installed]
installing sound-theme-freedesktop...
installing libcanberra...
installing iso-codes...
installing libcloudproviders...
installing libstemmer...
installing libsoup3...
Optional dependencies for libsoup3
samba: Windows Domain SSO
installing tracker3...
Optional dependencies for tracker3
libsoup: Alternative remoting backend [installed]
installing gtk3...
installing gstreamer...
installing orc...
installing libxv...
installing libgudev...
installing gst-plugins-base-libs...
installing wxgtk-common...
installing libnotify...
installing wxgtk3...
Optional dependencies for wxgtk3
webkit2gtk: for webview support
installing python-wxpython...
Optional dependencies for python-wxpython
python-pypubsub: Alternative to the deprecated wx.lib.pubsub API
installing ros-melodic-actionlib...
installing ros-melodic-message-filters...
installing ros-melodic-tf2-ros...
installing ros-melodic-sensor-msgs...
installing libxt...
installing libxpm...
installing giflib...
installing libwebp...
Optional dependencies for libwebp
freeglut: vwebp viewer
installing aom...
installing dav1d...
Optional dependencies for dav1d
dav1d-doc: HTML documentation
installing rav1e...
installing svt-av1...
installing libyuv...
installing libavif...
installing libde265...
Optional dependencies for libde265
ffmpeg: for sherlock265
qt5-base: for sherlock265
sdl: dec265 YUV overlay output
installing x265...
installing libheif...
Optional dependencies for libheif
libjpeg: for heif-convert and heif-enc [installed]
libpng: for heif-convert and heif-enc [installed]
installing gd...
Optional dependencies for gd
perl: bdftogd script [installed]
installing libxmu...
installing libxaw...
installing jbig2dec...
installing run-parts...
installing libpaper...
installing ijs...
installing openjpeg2...
installing libidn...
installing ghostscript...
Optional dependencies for ghostscript
texlive-core: needed for dvipdf
gtk3: needed for gsx [installed]
installing netpbm...
installing gts...
installing gsfonts...
installing graphviz...
Warning: Could not load "/usr/lib/graphviz/libgvplugin_gdk.so.6" - It was found, so perhaps one of its dependents was not. Try ldd.
Warning: Could not load "/usr/lib/graphviz/libgvplugin_gtk.so.6" - It was found, so perhaps one of its dependents was not. Try ldd.
Warning: Could not load "/usr/lib/graphviz/libgvplugin_gdk.so.6" - It was found, so perhaps one of its dependents was not. Try ldd.
Warning: Could not load "/usr/lib/graphviz/libgvplugin_gtk.so.6" - It was found, so perhaps one of its dependents was not. Try ldd.
Optional dependencies for graphviz
mono: sharp bindings
guile: guile bindings [installed]
lua: lua bindings
ocaml: ocaml bindings
perl: perl bindings [installed]
python: python bindings [installed]
r: r bindings
tcl: tcl bindings
qt5-base: gvedit
gtk2: gtk output plugin
xterm: vimdot
:: Running post-transaction hooks...
( 1/15) Creating system user accounts...
Creating group 'avahi' with GID 974.
Creating user 'avahi' (Avahi mDNS/DNS-SD daemon) with UID 974 and GID 974.
( 2/15) Reloading system manager configuration...
Skipped: Current root is not booted.
( 3/15) Arming ConditionNeedsUpdate...
( 4/15) Updating the MIME type database...
( 5/15) Updating fontconfig configuration...
( 6/15) Reloading system bus configuration...
Skipped: Current root is not booted.
( 7/15) Warn about old perl modules
( 8/15) Updating fontconfig cache...
( 9/15) Probing GDK-Pixbuf loader modules...
(10/15) Updating GIO module cache...
(11/15) Compiling GSettings XML schema files...
(12/15) Probing GTK3 input method modules...
(13/15) Updating icon theme caches...
(14/15) Updating the info directory file...
(15/15) Updating the desktop file MIME type cache...
==> Checking buildtime dependencies...
==> Installing missing dependencies...
resolving dependencies...
looking for conflicting packages...

Packages (5) jsoncpp-1.9.5-1 libuv-1.43.0-1 rhash-1.4.2-1 cmake-3.22.1-5 ros-melodic-angles-1.9.13-5

Total Installed Size: 63.85 MiB

:: Proceed with installation? [Y/n]
checking keyring...
checking package integrity...
loading package files...
checking for file conflicts...
checking available disk space...
:: Processing package changes...
installing jsoncpp...
Optional dependencies for jsoncpp
jsoncpp-doc: documentation
installing libuv...
installing rhash...
installing cmake...
Optional dependencies for cmake
qt6-base: cmake-gui
installing ros-melodic-angles...
:: Running post-transaction hooks...
(1/4) Arming ConditionNeedsUpdate...
(2/4) Updating the MIME type database...
(3/4) Updating icon theme caches...
(4/4) Updating the desktop file MIME type cache...
==> Retrieving sources...
-> Downloading ros-melodic-tf-1.12.1.tar.gz...
% Total % Received % Xferd Average Speed Time Time Time Current
Dload Upload Total Spent Left Speed

0 0 0 0 0 0 0 0 --:--:-- --:--:-- --:--:-- 0
100 120 100 120 0 0 612 0 --:--:-- --:--:-- --:--:-- 615

100 183k 0 183k 0 0 456k 0 --:--:-- --:--:-- --:--:-- 456k
==> Validating source files with sha256sums...
ros-melodic-tf-1.12.1.tar.gz ... Passed
==> Extracting sources...
-> Extracting ros-melodic-tf-1.12.1.tar.gz with bsdtar
==> Starting build()...
-- The C compiler identification is GNU 11.1.0
-- The CXX compiler identification is GNU 11.1.0
-- Detecting C compiler ABI info
-- Detecting C compiler ABI info - done
-- Check for working C compiler: /usr/bin/cc - skipped
-- Detecting C compile features
-- Detecting C compile features - done
-- Detecting CXX compiler ABI info
-- Detecting CXX compiler ABI info - done
-- Check for working CXX compiler: /usr/bin/c++ - skipped
-- Detecting CXX compile features
-- Detecting CXX compile features - done
-- Performing Test COMPILER_SUPPORTS_CXX11
-- Performing Test COMPILER_SUPPORTS_CXX11 - Success
-- Using CATKIN_DEVEL_PREFIX: /build/src/build/devel
-- Using CMAKE_PREFIX_PATH: /opt/ros/melodic
-- This workspace overlays: /opt/ros/melodic
-- Found PythonInterp: /usr/bin/python3 (found suitable version "3.10.1", minimum required is "2")
-- Using PYTHON_EXECUTABLE: /usr/bin/python3
-- Using default Python package layout
-- Found PY_em: /usr/lib/python3.10/site-packages/em.py
-- Using empy: /usr/lib/python3.10/site-packages/em.py
-- Using CATKIN_ENABLE_TESTING: ON
-- Skip enable_testing() when building binary package
-- Using CATKIN_TEST_RESULTS_DIR: /build/src/build/test_results
-- Forcing gtest/gmock from source, though one was otherwise available.
-- Found gtest sources under '/usr/src/gmock': gtests will be built
-- Found gmock sources under '/usr/src/gmock': gmock will be built
-- Found Python: /usr/bin/python3.10 (found version "3.10.1") found components: Interpreter
-- Found Threads: TRUE
-- Using Python nosetests: /usr/bin/nosetests-3.10
-- catkin 0.7.29
-- BUILD_SHARED_LIBS is on
-- Using these message generators: gencpp;geneus;genlisp;gennodejs;genpy
-- Found Boost: /opt/boost1.69/include (found version "1.69.0") found components: thread system chrono date_time atomic
/opt/ros/melodic/share/catkin/cmake/interrogate_setup_dot_py.py:43: DeprecationWarning: The distutils package is deprecated and slated for removal in Python 3.12. Use setuptools or check PEP 632 for potential alternatives
import distutils.core
-- tf: 1 messages, 1 services
-- Configuring done
-- Generating done
-- Build files have been written to: /build/src/build
[ 0%] Built target geometry_msgs_generate_messages_py
[ 0%] Built target std_msgs_generate_messages_py
[ 0%] Built target _tf_generate_messages_check_deps_FrameGraph
[ 0%] Built target sensor_msgs_generate_messages_py
[ 0%] Built target geometry_msgs_generate_messages_cpp
[ 0%] Built target std_msgs_generate_messages_cpp
[ 0%] Built target _tf_generate_messages_check_deps_tfMessage
[ 0%] Built target sensor_msgs_generate_messages_cpp
[ 0%] Built target geometry_msgs_generate_messages_eus
[ 0%] Built target std_msgs_generate_messages_eus
[ 0%] Built target sensor_msgs_generate_messages_eus
[ 0%] Built target geometry_msgs_generate_messages_lisp
[ 0%] Built target std_msgs_generate_messages_lisp
[ 0%] Built target sensor_msgs_generate_messages_lisp
[ 0%] Built target geometry_msgs_generate_messages_nodejs
[ 0%] Built target std_msgs_generate_messages_nodejs
[ 0%] Built target sensor_msgs_generate_messages_nodejs
[ 0%] Built target roscpp_generate_messages_cpp
[ 0%] Built target roscpp_generate_messages_eus
[ 0%] Built target roscpp_generate_messages_lisp
[ 0%] Built target roscpp_generate_messages_nodejs
[ 0%] Built target roscpp_generate_messages_py
[ 0%] Built target rosgraph_msgs_generate_messages_cpp
[ 0%] Built target rosgraph_msgs_generate_messages_eus
[ 0%] Built target rosgraph_msgs_generate_messages_lisp
[ 0%] Built target rosgraph_msgs_generate_messages_nodejs
[ 0%] Built target rosgraph_msgs_generate_messages_py
[ 0%] Built target actionlib_generate_messages_cpp
[ 0%] Built target actionlib_generate_messages_eus
[ 0%] Built target actionlib_generate_messages_lisp
[ 0%] Built target actionlib_generate_messages_nodejs
[ 0%] Built target actionlib_generate_messages_py
[ 0%] Built target actionlib_msgs_generate_messages_cpp
[ 0%] Built target actionlib_msgs_generate_messages_eus
[ 0%] Built target actionlib_msgs_generate_messages_lisp
[ 0%] Built target actionlib_msgs_generate_messages_nodejs
[ 0%] Built target actionlib_msgs_generate_messages_py
[ 0%] Built target tf2_msgs_generate_messages_cpp
[ 0%] Built target tf2_msgs_generate_messages_eus
[ 0%] Built target tf2_msgs_generate_messages_lisp
[ 0%] Built target tf2_msgs_generate_messages_nodejs
[ 0%] Built target tf2_msgs_generate_messages_py
[ 2%] Building CXX object googletest/CMakeFiles/gtest.dir/src/gtest-all.cc.o
[ 5%] Generating Python from MSG tf/tfMessage
[ 8%] Generating Python code from SRV tf/FrameGraph
[ 11%] Generating Python msg __init__.py for tf
[ 13%] Generating Python srv __init__.py for tf
[ 13%] Built target tf_generate_messages_py
[ 16%] Generating C++ code from tf/tfMessage.msg
[ 19%] Generating C++ code from tf/FrameGraph.srv
[ 19%] Built target tf_generate_messages_cpp
[ 22%] Generating EusLisp code from tf/tfMessage.msg
[ 25%] Generating EusLisp code from tf/FrameGraph.srv
[ 27%] Generating EusLisp manifest code for tf
[ 27%] Built target tf_generate_messages_eus
[ 30%] Generating Lisp code from tf/tfMessage.msg
[ 33%] Generating Lisp code from tf/FrameGraph.srv
[ 33%] Built target tf_generate_messages_lisp
[ 36%] Generating Javascript code from tf/tfMessage.msg
[ 38%] Generating Javascript code from tf/FrameGraph.srv
[ 38%] Built target tf_generate_messages_nodejs
[ 38%] Built target tf_generate_messages
[ 41%] Building CXX object CMakeFiles/tf.dir/src/cache.cpp.o
In file included from /usr/include/log4cxx/log4cxx.h:45,
from /usr/include/log4cxx/logstring.h:28,
from /usr/include/log4cxx/level.h:22,
from /opt/ros/melodic/include/ros/console.h:46,
from /build/src/geometry-1.12.1/tf/include/tf/transform_datatypes.h:44,
from /build/src/geometry-1.12.1/tf/include/tf/time_cache.h:38,
from /build/src/geometry-1.12.1/tf/src/cache.cpp:32:
/usr/include/log4cxx/boost-std-configuration.h:10:18: error: ‘shared_mutex’ in namespace ‘std’ does not name a type
10 | typedef std::shared_mutex shared_mutex;
| ^~~~~~~~~~~~
/usr/include/log4cxx/boost-std-configuration.h:10:13: note: ‘std::shared_mutex’ is only available from C++17 onwards
10 | typedef std::shared_mutex shared_mutex;
| ^~~
/usr/include/log4cxx/boost-std-configuration.h:12:30: error: ‘shared_lock’ in namespace ‘std’ does not name a template type
12 | using shared_lock = std::shared_lock<T>;
| ^~~~~~~~~~~
/usr/include/log4cxx/boost-std-configuration.h:12:25: note: ‘std::shared_lock’ is only available from C++14 onwards
12 | using shared_lock = std::shared_lock<T>;
| ^~~
In file included from /opt/ros/melodic/include/ros/console.h:46,
from /build/src/geometry-1.12.1/tf/include/tf/transform_datatypes.h:44,
from /build/src/geometry-1.12.1/tf/include/tf/time_cache.h:38,
from /build/src/geometry-1.12.1/tf/src/cache.cpp:32:
/usr/include/log4cxx/level.h:283:29: error: ‘mutex’ in namespace ‘std’ does not name a type
283 | static std::mutex initMutex;
| ^~~~~
/usr/include/log4cxx/level.h:25:1: note: ‘std::mutex’ is defined in header ‘<mutex>’; did you forget to ‘#include <mutex>’?
24 | #include <log4cxx/helpers/object.h>
+++ |+#include <mutex>
25 |
make[2]: *** [CMakeFiles/tf.dir/build.make:76: CMakeFiles/tf.dir/src/cache.cpp.o] Error 1
make[1]: *** [CMakeFiles/Makefile2:1811: CMakeFiles/tf.dir/all] Error 2
make[1]: *** Waiting for unfinished jobs....
[ 44%] Linking CXX shared library ../gtest/lib/libgtest.so
[ 44%] Built target gtest
make: *** [Makefile:136: all] Error 2
==> ERROR: A failure occurred in build().
Aborting...
No packages were built!

Git push to AUR Output
[up to date]