Package Name ros-melodic-tf2-py
Status FAILURE
Last Build Date 20.1.2022 01:29
Repo URL git://github.com/ros-melodic-arch/ros-melodic-tf2-py.git

Build Output
:: Synchronizing package databases...
core downloading...
extra downloading...
community downloading...
multilib downloading...
abs_cd-local downloading...
==> Making package: ros-melodic-tf2-py 0.6.6-3 (Thu 20 Jan 2022 01:28:47 AM UTC)
==> Checking runtime dependencies...
==> Installing missing dependencies...
resolving dependencies...
looking for conflicting packages...

Packages (58) blas-3.10.0-1 boost1.69-1.69.0-10 boost1.69-libs-1.69.0-10 cblas-3.10.0-1 console-bridge-1.0.1-2 gtest-1.11.0-3 lapack-3.10.0-1 libyaml-0.2.5-1 log4cxx-0.12.0-1 python-appdirs-1.4.4-6 python-argparse-1.4.0-11 python-catkin_pkg-0.4.24-1 python-dateutil-2.8.2-4 python-distro-1.6.0-4 python-docutils-1:0.16-2 python-empy-3.3.4-7 python-more-itertools-8.10.0-4 python-netifaces-0.11.0-3 python-nose-1.3.7-13 python-numpy-1.21.5-2 python-ordered-set-4.0.2-6 python-packaging-20.9-7 python-pyparsing-2.4.7-6 python-rosdep-0.21.0-1 python-rosdistro-0.8.3-1 python-rospkg-1.3.0-1 python-setuptools-1:59.1.1-1 python-yaml-5.4.1.1-4 ros-build-tools-py3-0.3.1-2 ros-melodic-actionlib-msgs-1.12.8-2 ros-melodic-catkin-1:0.7.29-3 ros-melodic-cpp-common-0.6.14-4 ros-melodic-gencpp-0.6.5-3 ros-melodic-geneus-2.2.6-2 ros-melodic-genlisp-0.4.16-1 ros-melodic-genmsg-0.5.16-2 ros-melodic-gennodejs-2.0.1-2 ros-melodic-genpy-0.6.16-1 ros-melodic-geometry-msgs-1.12.8-1 ros-melodic-message-generation-0.4.1-3 ros-melodic-message-runtime-0.4.12-3 ros-melodic-ros-environment-1.2.3-2 ros-melodic-rosbuild-1.14.9-2 ros-melodic-rosconsole-1.13.18-5 ros-melodic-roscpp-1.14.11-1 ros-melodic-roscpp-serialization-0.6.14-2 ros-melodic-roscpp-traits-0.6.14-2 ros-melodic-rosgraph-1.14.11-1 ros-melodic-rosgraph-msgs-1.11.2-3 ros-melodic-roslib-1.14.9-4 ros-melodic-rospack-2.5.6-4 ros-melodic-rostime-0.6.14-4 ros-melodic-std-msgs-0.5.13-1 ros-melodic-tf2-msgs-0.6.6-2 ros-melodic-xmlrpcpp-1.14.11-1 tinyxml2-9.0.0-1 ros-melodic-rospy-1.14.11-2 ros-melodic-tf2-0.6.6-4

Total Installed Size: 241.17 MiB

:: Proceed with installation? [Y/n]
checking keyring...
checking package integrity...
loading package files...
checking for file conflicts...
checking available disk space...
:: Processing package changes...
installing boost1.69-libs...
Optional dependencies for boost1.69-libs
openmpi: for mpi support
installing boost1.69...
Optional dependencies for boost1.69
python: for python bindings [installed]
installing console-bridge...
installing ros-melodic-cpp-common...
installing ros-melodic-rostime...
installing python-appdirs...
installing python-more-itertools...
installing python-ordered-set...
installing python-pyparsing...
installing python-packaging...
installing python-setuptools...
installing python-nose...
installing gtest...
Optional dependencies for gtest
python: gmock generator [installed]
installing python-argparse...
installing python-dateutil...
installing python-docutils...
installing python-catkin_pkg...
installing python-empy...
installing ros-build-tools-py3...
Optional dependencies for ros-build-tools-py3
python3 [installed]
python-argparse [installed]
python-yaml [pending]
python-termcolor
python-certifi
installing ros-melodic-catkin...
installing ros-melodic-genmsg...
installing ros-melodic-geneus...
installing ros-melodic-gencpp...
installing libyaml...
installing python-yaml...
installing ros-melodic-genpy...
installing ros-melodic-gennodejs...
installing ros-melodic-genlisp...
installing ros-melodic-message-generation...
installing ros-melodic-roscpp-traits...
installing ros-melodic-roscpp-serialization...
installing ros-melodic-message-runtime...
installing ros-melodic-std-msgs...
installing ros-melodic-actionlib-msgs...
installing ros-melodic-geometry-msgs...
installing ros-melodic-tf2-msgs...
installing ros-melodic-tf2...
installing ros-melodic-rosgraph-msgs...
installing ros-melodic-xmlrpcpp...
installing ros-melodic-rosbuild...
installing log4cxx...
installing ros-melodic-rosconsole...
installing ros-melodic-roscpp...
installing python-netifaces...
installing python-distro...
installing python-rospkg...
installing ros-melodic-rosgraph...
installing ros-melodic-ros-environment...
installing tinyxml2...
installing python-rosdistro...
installing python-rosdep...
installing ros-melodic-rospack...
installing ros-melodic-roslib...
installing blas...
installing cblas...
installing lapack...
installing python-numpy...
Optional dependencies for python-numpy
openblas: faster linear algebra
installing ros-melodic-rospy...
:: Running post-transaction hooks...
(1/1) Arming ConditionNeedsUpdate...
==> Checking buildtime dependencies...
==> Installing missing dependencies...
resolving dependencies...
looking for conflicting packages...

Packages (5) hicolor-icon-theme-0.17-2 jsoncpp-1.9.5-1 libuv-1.43.0-1 rhash-1.4.2-1 cmake-3.22.1-5

Total Installed Size: 63.86 MiB

:: Proceed with installation? [Y/n]
checking keyring...
checking package integrity...
loading package files...
checking for file conflicts...
checking available disk space...
:: Processing package changes...
installing hicolor-icon-theme...
installing jsoncpp...
Optional dependencies for jsoncpp
jsoncpp-doc: documentation
installing libuv...
installing rhash...
installing cmake...
Optional dependencies for cmake
qt6-base: cmake-gui
:: Running post-transaction hooks...
(1/1) Arming ConditionNeedsUpdate...
==> Retrieving sources...
-> Downloading ros-melodic-tf2-py-0.6.6.tar.gz...
% Total % Received % Xferd Average Speed Time Time Time Current
Dload Upload Total Spent Left Speed

0 0 0 0 0 0 0 0 --:--:-- --:--:-- --:--:-- 0
100 120 100 120 0 0 4741 0 --:--:-- --:--:-- --:--:-- 4800

100 166k 0 166k 0 0 709k 0 --:--:-- --:--:-- --:--:-- 709k
==> Validating source files with sha256sums...
ros-melodic-tf2-py-0.6.6.tar.gz ... Passed
==> Extracting sources...
-> Extracting ros-melodic-tf2-py-0.6.6.tar.gz with bsdtar
==> Starting build()...
CMake Deprecation Warning at CMakeLists.txt:1 (cmake_minimum_required):
Compatibility with CMake < 2.8.12 will be removed from a future version of
CMake.

Update the VERSION argument <min> value or use a ...<max> suffix to tell
CMake that the project does not need compatibility with older versions.


-- The C compiler identification is GNU 11.1.0
-- The CXX compiler identification is GNU 11.1.0
-- Detecting C compiler ABI info
-- Detecting C compiler ABI info - done
-- Check for working C compiler: /usr/bin/cc - skipped
-- Detecting C compile features
-- Detecting C compile features - done
-- Detecting CXX compiler ABI info
-- Detecting CXX compiler ABI info - done
-- Check for working CXX compiler: /usr/bin/c++ - skipped
-- Detecting CXX compile features
-- Detecting CXX compile features - done
-- Using CATKIN_DEVEL_PREFIX: /build/src/build/devel
-- Using CMAKE_PREFIX_PATH: /opt/ros/melodic
-- This workspace overlays: /opt/ros/melodic
-- Found PythonInterp: /usr/bin/python3 (found suitable version "3.10.1", minimum required is "2")
-- Using PYTHON_EXECUTABLE: /usr/bin/python3
-- Using default Python package layout
-- Found PY_em: /usr/lib/python3.10/site-packages/em.py
-- Using empy: /usr/lib/python3.10/site-packages/em.py
-- Using CATKIN_ENABLE_TESTING: ON
-- Skip enable_testing() when building binary package
-- Using CATKIN_TEST_RESULTS_DIR: /build/src/build/test_results
-- Forcing gtest/gmock from source, though one was otherwise available.
-- Found gtest sources under '/usr/src/gmock': gtests will be built
-- Found gmock sources under '/usr/src/gmock': gmock will be built
-- Found Python: /usr/bin/python3.10 (found version "3.10.1") found components: Interpreter
-- Found Threads: TRUE
-- Using Python nosetests: /usr/bin/nosetests-3.10
-- catkin 0.7.29
-- BUILD_SHARED_LIBS is on
-- Using these message generators: gencpp;geneus;genlisp;gennodejs;genpy
-- Found PythonLibs: /usr/lib/libpython3.9.so (Required is at least version "2")
/opt/ros/melodic/share/catkin/cmake/interrogate_setup_dot_py.py:43: DeprecationWarning: The distutils package is deprecated and slated for removal in Python 3.12. Use setuptools or check PEP 632 for potential alternatives
import distutils.core
-- Configuring done
-- Generating done
CMake Warning:
Manually-specified variables were not used by the project:

PYTHON_BASENAME


-- Build files have been written to: /build/src/build
[ 0%] Built target geometry_msgs_generate_messages_nodejs
[ 0%] Built target actionlib_msgs_generate_messages_py
[ 0%] Built target geometry_msgs_generate_messages_py
[ 0%] Built target std_msgs_generate_messages_cpp
[ 0%] Built target tf2_msgs_generate_messages_cpp
[ 0%] Built target tf2_msgs_generate_messages_eus
[ 0%] Built target tf2_msgs_generate_messages_lisp
[ 0%] Built target tf2_msgs_generate_messages_nodejs
[ 0%] Built target tf2_msgs_generate_messages_py
[ 0%] Built target _catkin_empty_exported_target
[ 0%] Built target actionlib_msgs_generate_messages_cpp
[ 0%] Built target actionlib_msgs_generate_messages_eus
[ 0%] Built target std_msgs_generate_messages_eus
[ 0%] Built target std_msgs_generate_messages_lisp
[ 0%] Built target std_msgs_generate_messages_nodejs
[ 0%] Built target std_msgs_generate_messages_py
[ 0%] Built target geometry_msgs_generate_messages_cpp
[ 0%] Built target geometry_msgs_generate_messages_eus
[ 0%] Built target actionlib_msgs_generate_messages_lisp
[ 0%] Built target geometry_msgs_generate_messages_lisp
[ 0%] Built target actionlib_msgs_generate_messages_nodejs
make[2]: *** No rule to make target '/usr/lib/libpython3.9.so', needed by 'devel/lib/python3.10/site-packages/tf2_py/_tf2.so'. Stop.
make[2]: *** Waiting for unfinished jobs....
[ 50%] Building CXX object CMakeFiles/tf2_py.dir/src/tf2_py.cpp.o
/build/src/geometry2-0.6.6/tf2_py/src/tf2_py.cpp:1:10: fatal error: Python.h: No such file or directory
1 | #include <Python.h>
| ^~~~~~~~~~
compilation terminated.
make[2]: *** [CMakeFiles/tf2_py.dir/build.make:76: CMakeFiles/tf2_py.dir/src/tf2_py.cpp.o] Error 1
make[1]: *** [CMakeFiles/Makefile2:840: CMakeFiles/tf2_py.dir/all] Error 2
make: *** [Makefile:136: all] Error 2
==> ERROR: A failure occurred in build().
Aborting...
No packages were built!

Git push to AUR Output
[up to date]