ros-melodic-tracetools

Build Status: FAILURE     Last Build Date: 14.1.2021 21:13

Build Output
% Total % Received % Xferd Average Speed Time Time Time Current
Dload Upload Total Spent Left Speed

0 0 0 0 0 0 0 0 --:--:-- --:--:-- --:--:-- 0
100 135 100 135 0 0 894 0 --:--:-- --:--:-- --:--:-- 894

0 0 0 0 0 0 0 0 --:--:-- --:--:-- --:--:-- 0
100 136 0 136 0 0 397 0 --:--:-- --:--:-- --:--:-- 985

100 19271 0 19271 0 0 34785 0 --:--:-- --:--:-- --:--:-- 34785
ros-melodic-tracetools-0.2.1.tar.gz ... Passed
CMake Deprecation Warning at CMakeLists.txt:1 (cmake_minimum_required):
Compatibility with CMake < 2.8.12 will be removed from a future version of
CMake.

Update the VERSION argument <min> value or use a ...<max> suffix to tell
CMake that the project does not need compatibility with older versions.


CMake Warning at /usr/src/gmock/CMakeLists.txt:43 (project):
VERSION keyword not followed by a value or was followed by a value that
expanded to nothing.


CMake Deprecation Warning at /usr/src/gmock/CMakeLists.txt:45 (cmake_minimum_required):
Compatibility with CMake < 2.8.12 will be removed from a future version of
CMake.

Update the VERSION argument <min> value or use a ...<max> suffix to tell
CMake that the project does not need compatibility with older versions.


CMake Warning at /usr/src/googletest/CMakeLists.txt:54 (project):
VERSION keyword not followed by a value or was followed by a value that
expanded to nothing.


CMake Deprecation Warning at /usr/src/googletest/CMakeLists.txt:56 (cmake_minimum_required):
Compatibility with CMake < 2.8.12 will be removed from a future version of
CMake.

Update the VERSION argument <min> value or use a ...<max> suffix to tell
CMake that the project does not need compatibility with older versions.


In file included from /build/src/ros1_tracetools-0.2.1/test/test_get_ptr.cpp:3:
/build/src/ros1_tracetools-0.2.1/include/tracetools/tracetools.h:14:10: fatal error: boost/shared_ptr.hpp: No such file or directory
14 | #include <boost/shared_ptr.hpp>
| ^~~~~~~~~~~~~~~~~~~~~~
compilation terminated.
make[2]: *** [CMakeFiles/test_get_ptr.dir/build.make:82: CMakeFiles/test_get_ptr.dir/test/test_get_ptr.cpp.o] Error 1
make[1]: *** [CMakeFiles/Makefile2:283: CMakeFiles/test_get_ptr.dir/all] Error 2
make[1]: *** Waiting for unfinished jobs....
In file included from /build/src/ros1_tracetools-0.2.1/src/tracetools/tracetools.cpp:18:
/build/src/ros1_tracetools-0.2.1/include/tracetools/tracetools.h:14:10: fatal error: boost/shared_ptr.hpp: No such file or directory
14 | #include <boost/shared_ptr.hpp>
| ^~~~~~~~~~~~~~~~~~~~~~
compilation terminated.
make[2]: *** [CMakeFiles/tracetools.dir/build.make:82: CMakeFiles/tracetools.dir/src/tracetools/tracetools.cpp.o] Error 1
make[1]: *** [CMakeFiles/Makefile2:310: CMakeFiles/tracetools.dir/all] Error 2
make: *** [Makefile:149: all] Error 2
==> ERROR: A failure occurred in build().
Aborting...
No packages were built!
   
Git push to AUR Output
[up to date]